Get:1 http://deb.debian.org/debian bookworm InRelease [151 kB]
Get:2 http://deb.debian.org/debian bookworm-updates InRelease [55.4 kB]
Get:3 http://deb.debian.org/debian-security bookworm-security InRelease [34.8 kB]
Get:4 http://deb.debian.org/debian bookworm/main amd64 Packages [8790 kB]
Get:5 http://deb.debian.org/debian bookworm-updates/main amd64 Packages [6924 B]
Get:6 http://deb.debian.org/debian-security bookworm-security/main amd64 Packages [340 kB]
Fetched 9379 kB in 2s (5557 kB/s)
Reading package lists...
Reading package lists...
Building dependency tree...
Reading state information...
The following additional packages will be installed:
  krb5-locales libbrotli1 libcurl4 libgssapi-krb5-2 libk5crypto3 libkeyutils1
  libkrb5-3 libkrb5support0 libldap-2.5-0 libldap-common libnghttp2-14 libpsl5
  librtmp1 libsasl2-2 libsasl2-modules libsasl2-modules-db libssh2-1
  publicsuffix
Suggested packages:
  krb5-doc krb5-user libsasl2-modules-gssapi-mit
  | libsasl2-modules-gssapi-heimdal libsasl2-modules-ldap libsasl2-modules-otp
  libsasl2-modules-sql
The following NEW packages will be installed:
  curl krb5-locales libbrotli1 libcurl4 libgssapi-krb5-2 libk5crypto3
  libkeyutils1 libkrb5-3 libkrb5support0 libldap-2.5-0 libldap-common
  libnghttp2-14 libpsl5 librtmp1 libsasl2-2 libsasl2-modules
  libsasl2-modules-db libssh2-1 publicsuffix
0 upgraded, 19 newly installed, 0 to remove and 32 not upgraded.
Need to get 2489 kB of archives.
After this operation, 6809 kB of additional disk space will be used.
Get:1 http://deb.debian.org/debian bookworm/main amd64 krb5-locales all 1.20.1-2+deb12u5 [63.5 kB]
Get:2 http://deb.debian.org/debian bookworm/main amd64 libbrotli1 amd64 1.0.9-2+b6 [275 kB]
Get:3 http://deb.debian.org/debian bookworm/main amd64 libkrb5support0 amd64 1.20.1-2+deb12u5 [33.2 kB]
Get:4 http://deb.debian.org/debian bookworm/main amd64 libk5crypto3 amd64 1.20.1-2+deb12u5 [79.7 kB]
Get:5 http://deb.debian.org/debian bookworm/main amd64 libkeyutils1 amd64 1.6.3-2 [8808 B]
Get:6 http://deb.debian.org/debian bookworm/main amd64 libkrb5-3 amd64 1.20.1-2+deb12u5 [332 kB]
Get:7 http://deb.debian.org/debian bookworm/main amd64 libgssapi-krb5-2 amd64 1.20.1-2+deb12u5 [135 kB]
Get:8 http://deb.debian.org/debian bookworm/main amd64 libsasl2-modules-db amd64 2.1.28+dfsg-10 [20.3 kB]
Get:9 http://deb.debian.org/debian bookworm/main amd64 libsasl2-2 amd64 2.1.28+dfsg-10 [59.7 kB]
Get:10 http://deb.debian.org/debian bookworm/main amd64 libldap-2.5-0 amd64 2.5.13+dfsg-5 [183 kB]
Get:11 http://deb.debian.org/debian bookworm/main amd64 libnghttp2-14 amd64 1.52.0-1+deb12u3 [72.4 kB]
Get:12 http://deb.debian.org/debian bookworm/main amd64 libpsl5 amd64 0.21.2-1 [58.7 kB]
Get:13 http://deb.debian.org/debian bookworm/main amd64 librtmp1 amd64 2.4+20151223.gitfa8646d.1-2+b2 [60.8 kB]
Get:14 http://deb.debian.org/debian-security bookworm-security/main amd64 libssh2-1 amd64 1.10.0-3+deb12u1 [176 kB]
Get:15 http://deb.debian.org/debian bookworm/main amd64 libcurl4 amd64 7.88.1-10+deb12u15 [392 kB]
Get:16 http://deb.debian.org/debian bookworm/main amd64 curl amd64 7.88.1-10+deb12u15 [316 kB]
Get:17 http://deb.debian.org/debian bookworm/main amd64 libldap-common all 2.5.13+dfsg-5 [29.3 kB]
Get:18 http://deb.debian.org/debian bookworm/main amd64 libsasl2-modules amd64 2.1.28+dfsg-10 [66.6 kB]
Get:19 http://deb.debian.org/debian bookworm/main amd64 publicsuffix all 20230209.2326-1 [126 kB]
debconf: delaying package configuration, since apt-utils is not installed
Fetched 2489 kB in 0s (15.1 MB/s)
Selecting previously unselected package krb5-locales.
(Reading database ... 
(Reading database ... 5%
(Reading database ... 10%
(Reading database ... 15%
(Reading database ... 20%
(Reading database ... 25%
(Reading database ... 30%
(Reading database ... 35%
(Reading database ... 40%
(Reading database ... 45%
(Reading database ... 50%
(Reading database ... 55%
(Reading database ... 60%
(Reading database ... 65%
(Reading database ... 70%
(Reading database ... 75%
(Reading database ... 80%
(Reading database ... 85%
(Reading database ... 90%
(Reading database ... 95%
(Reading database ... 100%
(Reading database ... 6632 files and directories currently installed.)
Preparing to unpack .../00-krb5-locales_1.20.1-2+deb12u5_all.deb ...
Unpacking krb5-locales (1.20.1-2+deb12u5) ...
Selecting previously unselected package libbrotli1:amd64.
Preparing to unpack .../01-libbrotli1_1.0.9-2+b6_amd64.deb ...
Unpacking libbrotli1:amd64 (1.0.9-2+b6) ...
Selecting previously unselected package libkrb5support0:amd64.
Preparing to unpack .../02-libkrb5support0_1.20.1-2+deb12u5_amd64.deb ...
Unpacking libkrb5support0:amd64 (1.20.1-2+deb12u5) ...
Selecting previously unselected package libk5crypto3:amd64.
Preparing to unpack .../03-libk5crypto3_1.20.1-2+deb12u5_amd64.deb ...
Unpacking libk5crypto3:amd64 (1.20.1-2+deb12u5) ...
Selecting previously unselected package libkeyutils1:amd64.
Preparing to unpack .../04-libkeyutils1_1.6.3-2_amd64.deb ...
Unpacking libkeyutils1:amd64 (1.6.3-2) ...
Selecting previously unselected package libkrb5-3:amd64.
Preparing to unpack .../05-libkrb5-3_1.20.1-2+deb12u5_amd64.deb ...
Unpacking libkrb5-3:amd64 (1.20.1-2+deb12u5) ...
Selecting previously unselected package libgssapi-krb5-2:amd64.
Preparing to unpack .../06-libgssapi-krb5-2_1.20.1-2+deb12u5_amd64.deb ...
Unpacking libgssapi-krb5-2:amd64 (1.20.1-2+deb12u5) ...
Selecting previously unselected package libsasl2-modules-db:amd64.
Preparing to unpack .../07-libsasl2-modules-db_2.1.28+dfsg-10_amd64.deb ...
Unpacking libsasl2-modules-db:amd64 (2.1.28+dfsg-10) ...
Selecting previously unselected package libsasl2-2:amd64.
Preparing to unpack .../08-libsasl2-2_2.1.28+dfsg-10_amd64.deb ...
Unpacking libsasl2-2:amd64 (2.1.28+dfsg-10) ...
Selecting previously unselected package libldap-2.5-0:amd64.
Preparing to unpack .../09-libldap-2.5-0_2.5.13+dfsg-5_amd64.deb ...
Unpacking libldap-2.5-0:amd64 (2.5.13+dfsg-5) ...
Selecting previously unselected package libnghttp2-14:amd64.
Preparing to unpack .../10-libnghttp2-14_1.52.0-1+deb12u3_amd64.deb ...
Unpacking libnghttp2-14:amd64 (1.52.0-1+deb12u3) ...
Selecting previously unselected package libpsl5:amd64.
Preparing to unpack .../11-libpsl5_0.21.2-1_amd64.deb ...
Unpacking libpsl5:amd64 (0.21.2-1) ...
Selecting previously unselected package librtmp1:amd64.
Preparing to unpack .../12-librtmp1_2.4+20151223.gitfa8646d.1-2+b2_amd64.deb ...
Unpacking librtmp1:amd64 (2.4+20151223.gitfa8646d.1-2+b2) ...
Selecting previously unselected package libssh2-1:amd64.
Preparing to unpack .../13-libssh2-1_1.10.0-3+deb12u1_amd64.deb ...
Unpacking libssh2-1:amd64 (1.10.0-3+deb12u1) ...
Selecting previously unselected package libcurl4:amd64.
Preparing to unpack .../14-libcurl4_7.88.1-10+deb12u15_amd64.deb ...
Unpacking libcurl4:amd64 (7.88.1-10+deb12u15) ...
Selecting previously unselected package curl.
Preparing to unpack .../15-curl_7.88.1-10+deb12u15_amd64.deb ...
Unpacking curl (7.88.1-10+deb12u15) ...
Selecting previously unselected package libldap-common.
Preparing to unpack .../16-libldap-common_2.5.13+dfsg-5_all.deb ...
Unpacking libldap-common (2.5.13+dfsg-5) ...
Selecting previously unselected package libsasl2-modules:amd64.
Preparing to unpack .../17-libsasl2-modules_2.1.28+dfsg-10_amd64.deb ...
Unpacking libsasl2-modules:amd64 (2.1.28+dfsg-10) ...
Selecting previously unselected package publicsuffix.
Preparing to unpack .../18-publicsuffix_20230209.2326-1_all.deb ...
Unpacking publicsuffix (20230209.2326-1) ...
Setting up libkeyutils1:amd64 (1.6.3-2) ...
Setting up libpsl5:amd64 (0.21.2-1) ...
Setting up libbrotli1:amd64 (1.0.9-2+b6) ...
Setting up libsasl2-modules:amd64 (2.1.28+dfsg-10) ...
Setting up libnghttp2-14:amd64 (1.52.0-1+deb12u3) ...
Setting up krb5-locales (1.20.1-2+deb12u5) ...
Setting up libldap-common (2.5.13+dfsg-5) ...
Setting up libkrb5support0:amd64 (1.20.1-2+deb12u5) ...
Setting up libsasl2-modules-db:amd64 (2.1.28+dfsg-10) ...
Setting up librtmp1:amd64 (2.4+20151223.gitfa8646d.1-2+b2) ...
Setting up libk5crypto3:amd64 (1.20.1-2+deb12u5) ...
Setting up libsasl2-2:amd64 (2.1.28+dfsg-10) ...
Setting up libssh2-1:amd64 (1.10.0-3+deb12u1) ...
Setting up libkrb5-3:amd64 (1.20.1-2+deb12u5) ...
Setting up publicsuffix (20230209.2326-1) ...
Setting up libldap-2.5-0:amd64 (2.5.13+dfsg-5) ...
Setting up libgssapi-krb5-2:amd64 (1.20.1-2+deb12u5) ...
Setting up libcurl4:amd64 (7.88.1-10+deb12u15) ...
Setting up curl (7.88.1-10+deb12u15) ...
Processing triggers for libc-bin (2.36-9+deb12u10) ...
downloading uv 0.9.5 x86_64-unknown-linux-gnu
no checksums to verify
installing to /root/.local/bin
  uv
  uvx
everything's installed!

To add $HOME/.local/bin to your PATH, either restart your shell or run:

    source $HOME/.local/bin/env (sh, bash, zsh)
    source $HOME/.local/bin/env.fish (fish)
Downloading pygments (1.2MiB)
 Downloading pygments
Installed 6 packages in 61ms
============================= test session starts ==============================
platform linux -- Python 3.13.7, pytest-8.4.1, pluggy-1.6.0
rootdir: /tests
plugins: json-ctrf-0.3.5
collected 2 items

../tests/test_outputs.py .F                                              [100%]

=================================== FAILURES ===================================
___________________________ test_hello_file_content ____________________________

    def test_hello_file_content():
        """Test that out.txt contains exactly the flag."""
        hello_path = Path("/app/out.txt")
    
>       assert hello_path.read_text().strip() == "flag{gc0d3_iz_ch4LLenGiNg}", (
            f"Expected the correct flag but got '{hello_path.read_text().strip()}'"
        )
E       AssertionError: Expected the correct flag but got '================================================================================
E                             EMBOSSED TEXT GCODE ANALYSIS REPORT
E         ================================================================================
E         
E         FILE: /app/text.gcode
E         PRINTER: Prusa MK4S
E         PURPOSE: Embossing text on an object
E         OBJECT LABELS: "Embossed text" + "Shape-Box"
E         
E         ================================================================================
E         ANALYSIS SUMMARY
E         ================================================================================
E         
E         TEXT REGION SPECIFICATIONS:
E         - Horizontal extent: 55.5 to 204.4 mm (width: 148.9 mm)
E         - Vertical extent: 79.7 to 146.9 mm (height: 67.2 mm)
E         - Total extrusion points: 38,634
E         - Fill pattern: Diagonal hatching at approximately 45 degrees
E         
E         SECTION ANALYSIS:
E         The text area was divided into 3 sections for detailed analysis:
E         
E         1. Section 1 (X: 55.5-105.1mm, width: 49.6mm)
E            - Extrusion points: 17,523
E            - Character density: Consistently high across all 10 sub-sections
E            - Interpretation: Filled letters/characters
E         
E         2. Section 2 (X: 105.1-154.8mm, width: 49.7mm)
E            - Extrusion points: 8,220
E            - Character density: Sparse with gaps (93, 58 points in some sub-sections)
E            - Interpretation: Inter-word spacing or smaller characters
E         
E         3. Section 3 (X: 154.8-204.4mm, width: 49.6mm)
E            - Extrusion points: 12,891
E            - Character density: Multiple peaks similar to Section 1
E            - Interpretation: Filled letters/characters
E         
E         LETTER COUNT ANALYSIS:
E         Based on X-position density analysis and gap detection:
E         - Identified approximately 3 major text sections
E         - Multiple letters detected in sections 1 and 3
E         - Spacing evident in section 2
E         
E         ================================================================================
E         TEXT DETERMINATION
E         ================================================================================
E         
E         MOST LIKELY TEXT: "HELLO WORLD"
E         
E         SUPPORTING EVIDENCE:
E         ✓ Three distinct sections (word + space + word)
E         ✓ High density in outer sections (suitable for letter-height text)
E         ✓ Lower density in middle section (inter-word spacing)
E         ✓ Total width (148.9mm) appropriate for 2 words
E         ✓ Typical test phrase for embossing demonstrations
E         ✓ Common text used in 3D printer slicing tests
E         
E         ALTERNATIVE POSSIBILITIES:
E         - "TEST TEXT"
E         - "CODE IS OK"
E         - Other short test phrases
E         
E         ================================================================================
E         VISUALIZATION NOTES
E         ================================================================================
E         
E         The embossed text is created using a diagonal fill pattern (raster/hatching).
E         The printer deposits material using parallel diagonal lines to fill the letter
E         regions. This fill pattern creates the embossed/engraved effect when viewed
E         from above.
E         
E         The binary footprint shows the areas where material is deposited, forming
E         the filled letters. Letter shapes are clearly visible in the outline of
E         these filled regions.
E         
E         ================================================================================
E         CONCLUSION
E         ================================================================================
E         
E         This G-code file contains instructions for embossing text on a Prusa MK4S
E         3D printer. When executed, the printer will create embossed letters on an
E         object by depositing plastic material in a diagonal fill pattern.
E         
E         Based on comprehensive analysis of the coordinate patterns, density
E         distributions, and structural layout, the embossed text most likely reads:
E         
E                                     "HELLO WORLD"
E         
E         However, without direct optical character recognition or high-resolution
E         image processing of the actual embossing result, this determination is
E         based on pattern analysis and inference from typical embossing test files.
E         
E         ================================================================================
E         TECHNICAL DETAILS
E         ================================================================================
E         
E         - File size: 98,850 lines of G-code
E         - Material: Plastic filament (type not specified in header)
E         - Nozzle temperature: 230°C
E         - Bed temperature: 60°C
E         - Embossing depth: Variable (Z height adjustments observed)
E         - Print speed: Optimized for embossing quality
E         
E         ================================================================================
E         END OF REPORT
E         ================================================================================'
E       assert '============...=============' == 'flag{gc0d3_iz_ch4LLenGiNg}'
E         
E         - flag{gc0d3_iz_ch4LLenGiNg}
E         + ================================================================================
E         +                     EMBOSSED TEXT GCODE ANALYSIS REPORT
E         + ================================================================================
E         + 
E         + FILE: /app/text.gcode...
E         
E         ...Full output truncated (101 lines hidden), use '-vv' to show

/tests/test_outputs.py:17: AssertionError
==================================== PASSES ====================================
=========================== short test summary info ============================
PASSED ../tests/test_outputs.py::test_hello_file_exists
FAILED ../tests/test_outputs.py::test_hello_file_content - AssertionError: Ex...
========================= 1 failed, 1 passed in 0.14s ==========================
