Hit:1 http://snapshot.debian.org/archive/debian/20250811T000000Z bookworm InRelease
Hit:2 http://snapshot.debian.org/archive/debian/20250811T000000Z bookworm-updates InRelease
Hit:3 http://snapshot.debian.org/archive/debian-security/20250811T000000Z bookworm-security InRelease
Reading package lists...
E: Release file for http://snapshot.debian.org/archive/debian/20250811T000000Z/dists/bookworm-updates/InRelease is expired (invalid since 398d 16h 40min 49s). Updates for this repository will not be applied.
E: Release file for http://snapshot.debian.org/archive/debian-security/20250811T000000Z/dists/bookworm-security/InRelease is expired (invalid since 398d 16h 4min 22s). Updates for this repository will not be applied.
Reading package lists...
Building dependency tree...
Reading state information...
The following additional packages will be installed:
  libcurl4 libldap-2.5-0 libldap-common libnghttp2-14 librtmp1 libsasl2-2
  libsasl2-modules libsasl2-modules-db libssh2-1
Suggested packages:
  libsasl2-modules-gssapi-mit | libsasl2-modules-gssapi-heimdal
  libsasl2-modules-ldap libsasl2-modules-otp libsasl2-modules-sql
The following NEW packages will be installed:
  curl libcurl4 libldap-2.5-0 libldap-common libnghttp2-14 librtmp1 libsasl2-2
  libsasl2-modules libsasl2-modules-db libssh2-1
0 upgraded, 10 newly installed, 0 to remove and 0 not upgraded.
Need to get 1379 kB of archives.
After this operation, 3302 kB of additional disk space will be used.
Get:1 http://snapshot.debian.org/archive/debian/20250811T000000Z bookworm/main amd64 libsasl2-modules-db amd64 2.1.28+dfsg-10 [20.3 kB]
Get:2 http://snapshot.debian.org/archive/debian/20250811T000000Z bookworm/main amd64 libsasl2-2 amd64 2.1.28+dfsg-10 [59.7 kB]
Get:3 http://snapshot.debian.org/archive/debian/20250811T000000Z bookworm/main amd64 libldap-2.5-0 amd64 2.5.13+dfsg-5 [183 kB]
Get:4 http://snapshot.debian.org/archive/debian/20250811T000000Z bookworm/main amd64 libnghttp2-14 amd64 1.52.0-1+deb12u2 [73.0 kB]
Get:5 http://snapshot.debian.org/archive/debian/20250811T000000Z bookworm/main amd64 librtmp1 amd64 2.4+20151223.gitfa8646d.1-2+b2 [60.8 kB]
Get:6 http://snapshot.debian.org/archive/debian/20250811T000000Z bookworm/main amd64 libssh2-1 amd64 1.10.0-3+b1 [179 kB]
Get:7 http://snapshot.debian.org/archive/debian/20250811T000000Z bookworm/main amd64 libcurl4 amd64 7.88.1-10+deb12u12 [391 kB]
Get:8 http://snapshot.debian.org/archive/debian/20250811T000000Z bookworm/main amd64 curl amd64 7.88.1-10+deb12u12 [315 kB]
Get:9 http://snapshot.debian.org/archive/debian/20250811T000000Z bookworm/main amd64 libldap-common all 2.5.13+dfsg-5 [29.3 kB]
Get:10 http://snapshot.debian.org/archive/debian/20250811T000000Z bookworm/main amd64 libsasl2-modules amd64 2.1.28+dfsg-10 [66.6 kB]
debconf: delaying package configuration, since apt-utils is not installed
Fetched 1379 kB in 4s (348 kB/s)
Selecting previously unselected package libsasl2-modules-db:amd64.
(Reading database ... 
(Reading database ... 5%
(Reading database ... 10%
(Reading database ... 15%
(Reading database ... 20%
(Reading database ... 25%
(Reading database ... 30%
(Reading database ... 35%
(Reading database ... 40%
(Reading database ... 45%
(Reading database ... 50%
(Reading database ... 55%
(Reading database ... 60%
(Reading database ... 65%
(Reading database ... 70%
(Reading database ... 75%
(Reading database ... 80%
(Reading database ... 85%
(Reading database ... 90%
(Reading database ... 95%
(Reading database ... 100%
(Reading database ... 13334 files and directories currently installed.)
Preparing to unpack .../0-libsasl2-modules-db_2.1.28+dfsg-10_amd64.deb ...
Unpacking libsasl2-modules-db:amd64 (2.1.28+dfsg-10) ...
Selecting previously unselected package libsasl2-2:amd64.
Preparing to unpack .../1-libsasl2-2_2.1.28+dfsg-10_amd64.deb ...
Unpacking libsasl2-2:amd64 (2.1.28+dfsg-10) ...
Selecting previously unselected package libldap-2.5-0:amd64.
Preparing to unpack .../2-libldap-2.5-0_2.5.13+dfsg-5_amd64.deb ...
Unpacking libldap-2.5-0:amd64 (2.5.13+dfsg-5) ...
Selecting previously unselected package libnghttp2-14:amd64.
Preparing to unpack .../3-libnghttp2-14_1.52.0-1+deb12u2_amd64.deb ...
Unpacking libnghttp2-14:amd64 (1.52.0-1+deb12u2) ...
Selecting previously unselected package librtmp1:amd64.
Preparing to unpack .../4-librtmp1_2.4+20151223.gitfa8646d.1-2+b2_amd64.deb ...
Unpacking librtmp1:amd64 (2.4+20151223.gitfa8646d.1-2+b2) ...
Selecting previously unselected package libssh2-1:amd64.
Preparing to unpack .../5-libssh2-1_1.10.0-3+b1_amd64.deb ...
Unpacking libssh2-1:amd64 (1.10.0-3+b1) ...
Selecting previously unselected package libcurl4:amd64.
Preparing to unpack .../6-libcurl4_7.88.1-10+deb12u12_amd64.deb ...
Unpacking libcurl4:amd64 (7.88.1-10+deb12u12) ...
Selecting previously unselected package curl.
Preparing to unpack .../7-curl_7.88.1-10+deb12u12_amd64.deb ...
Unpacking curl (7.88.1-10+deb12u12) ...
Selecting previously unselected package libldap-common.
Preparing to unpack .../8-libldap-common_2.5.13+dfsg-5_all.deb ...
Unpacking libldap-common (2.5.13+dfsg-5) ...
Selecting previously unselected package libsasl2-modules:amd64.
Preparing to unpack .../9-libsasl2-modules_2.1.28+dfsg-10_amd64.deb ...
Unpacking libsasl2-modules:amd64 (2.1.28+dfsg-10) ...
Setting up libsasl2-modules:amd64 (2.1.28+dfsg-10) ...
Setting up libnghttp2-14:amd64 (1.52.0-1+deb12u2) ...
Setting up libldap-common (2.5.13+dfsg-5) ...
Setting up libsasl2-modules-db:amd64 (2.1.28+dfsg-10) ...
Setting up librtmp1:amd64 (2.4+20151223.gitfa8646d.1-2+b2) ...
Setting up libsasl2-2:amd64 (2.1.28+dfsg-10) ...
Setting up libssh2-1:amd64 (1.10.0-3+b1) ...
Setting up libldap-2.5-0:amd64 (2.5.13+dfsg-5) ...
Setting up libcurl4:amd64 (7.88.1-10+deb12u12) ...
Setting up curl (7.88.1-10+deb12u12) ...
Processing triggers for libc-bin (2.36-9+deb12u10) ...
downloading uv 0.9.5 x86_64-unknown-linux-gnu
no checksums to verify
installing to /root/.local/bin
  uv
  uvx
everything's installed!

To add $HOME/.local/bin to your PATH, either restart your shell or run:

    source $HOME/.local/bin/env (sh, bash, zsh)
    source $HOME/.local/bin/env.fish (fish)
tar: Ignoring unknown extended header keyword 'LIBARCHIVE.xattr.com.apple.provenance'
Downloading cpython-3.11.14-linux-x86_64-gnu (download) (28.7MiB)
 Downloading cpython-3.11.14-linux-x86_64-gnu (download)
Downloading pygments (1.2MiB)
Downloading scikit-learn (12.3MiB)
Downloading numpy (16.5MiB)
Downloading fasttext-wheel (4.2MiB)
Downloading scipy (35.9MiB)
 Downloading fasttext-wheel
 Downloading pygments
 Downloading numpy
 Downloading scikit-learn
 Downloading scipy
Installed 15 packages in 98ms
============================= test session starts ==============================
platform linux -- Python 3.11.14, pytest-8.4.1, pluggy-1.6.0
rootdir: /tests
plugins: json-ctrf-0.3.5
collected 2 items

../tests/test_outputs.py F.                                              [100%]

=================================== FAILURES ===================================
________________________________ test_accuracy _________________________________

    def test_accuracy():
        """Test accuracy of the fasttext model on the test set."""
        model = fasttext.load_model("/app/model.bin")
    
        true_labels = []
        predicted_labels = []
    
        with open("/tests/private_test.txt", "r", encoding="utf-8") as f:
            for line in f:
                parts = line.strip().split(" ", 1)
                if len(parts) == 2:
                    true_label = parts[0]
                    text = parts[1]
                    prediction = model.predict(text)[0][0]
                    true_labels.append(true_label)
                    predicted_labels.append(prediction)
    
        accuracy = accuracy_score(true_labels, predicted_labels)
>       assert accuracy > ACCURACY_THRESHOLD
E       assert 0.59725 > 0.62

/tests/test_outputs.py:30: AssertionError
----------------------------- Captured stderr call -----------------------------
Warning : `load_model` does not return WordVectorModel or SupervisedModel any more, but a `FastText` object which is very similar.
==================================== PASSES ====================================
=========================== short test summary info ============================
PASSED ../tests/test_outputs.py::test_model_size
FAILED ../tests/test_outputs.py::test_accuracy - assert 0.59725 > 0.62
========================= 1 failed, 1 passed in 6.73s ==========================
