.....................................................s.......F......FFFs [ 23%]
ssF..s.F...FF................s.........F................................ [ 47%]
......................................F.......s......................... [ 70%]
.........................................................FFF............ [ 94%]
...........F......                                                       [100%]
================================== FAILURES ===================================
C:\Users\niffy\restverify\tests\test_i2_compare.py:193: AssertionError: assert '/definitely/not/here' in 'restverify: the comparison source \\definitely\\not\\here does not exist.\n  next: fix the source path (`restverify init -r <repo> -s <path>`) or verify without it: `restverify run -r <repo> --no-source`\n'
C:\Users\niffy\AppData\Local\Python\pythoncore-3.14-64\Lib\pathlib\__init__.py:1213: OSError: [WinError 1314] A required privilege is not held by the client: 'restored.txt' -> 'C:\\Users\\niffy\\AppData\\Local\\Temp\\pytest-of-niffy\\pytest-8\\test_counts_and_bytes_are_exac0\\tree\\link'
C:\Users\niffy\AppData\Local\Python\pythoncore-3.14-64\Lib\pathlib\__init__.py:1213: OSError: [WinError 1314] A required privilege is not held by the client: 'restored.txt' -> 'C:\\Users\\niffy\\AppData\\Local\\Temp\\pytest-of-niffy\\pytest-8\\test_per_directory_rollup_is_d0\\tree\\link'
C:\Users\niffy\AppData\Local\Python\pythoncore-3.14-64\Lib\pathlib\__init__.py:1213: OSError: [WinError 1314] A required privilege is not held by the client: 'restored.txt' -> 'C:\\Users\\niffy\\AppData\\Local\\Temp\\pytest-of-niffy\\pytest-8\\test_largest_file_is_reported0\\tree\\link'
C:\Users\niffy\AppData\Local\Python\pythoncore-3.14-64\Lib\pathlib\__init__.py:1213: OSError: [WinError 1314] A required privilege is not held by the client: 'restored.txt' -> 'C:\\Users\\niffy\\AppData\\Local\\Temp\\pytest-of-niffy\\pytest-8\\test_owned_top_level_entries_a0\\tree\\link'
C:\Users\niffy\AppData\Local\Python\pythoncore-3.14-64\Lib\pathlib\__init__.py:1213: OSError: [WinError 1314] A required privilege is not held by the client: 'restored.txt' -> 'C:\\Users\\niffy\\AppData\\Local\\Temp\\pytest-of-niffy\\pytest-8\\test_a_vanishing_directory_tea0\\tree\\link'
C:\Users\niffy\restverify\tests\test_i2_manifest.py:210: AssertionError: assert '1 symlink(s) (recorded-not-followed)' in '✓ restored snapshot 9f3a2c00: 2 files / 1.5 KiB in 0s\n  manifest : 2 files, 1.5 KiB, 3 dirs, max depth 1, 0 symlink(...   note: without a source this only proves the restore completed; add one with `restverify init -r <repo> -s <path>`\n'
C:\Users\niffy\restverify\tests\test_i2_manifest.py:225: assert 0 == 1
C:\Users\niffy\restverify\tests\test_i3a_json.py:104: AssertionError: assert '/definitely/not/here' in 'the comparison source \\definitely\\not\\here does not exist.'
C:\Users\niffy\restverify\tests\test_i5a_cron.py:43: AssertionError: C:\Users\niffy\restverify\.venv\Scripts\python.exe -m restverify run -r /srv/backup
C:\Users\niffy\AppData\Local\Python\pythoncore-3.14-64\Lib\subprocess.py:1553: OSError: [WinError 193] %1 is not a valid Win32 application
C:\Users\niffy\AppData\Local\Python\pythoncore-3.14-64\Lib\subprocess.py:1553: OSError: [WinError 193] %1 is not a valid Win32 application
C:\Users\niffy\AppData\Local\Python\pythoncore-3.14-64\Lib\subprocess.py:1553: OSError: [WinError 193] %1 is not a valid Win32 application
C:\Users\niffy\restverify\tests\test_i7b_reconciliation.py:191: AssertionError: assert ['app.log', 'data/keep.txt'] == ['app.log']
=========================== short test summary info ===========================
FAILED tests/test_i2_compare.py::test_missing_source_is_a_teaching_error - As...
FAILED tests/test_i2_manifest.py::test_counts_and_bytes_are_exact - OSError: ...
FAILED tests/test_i2_manifest.py::test_per_directory_rollup_is_direct_and_recursive
FAILED tests/test_i2_manifest.py::test_largest_file_is_reported - OSError: [W...
FAILED tests/test_i2_manifest.py::test_owned_top_level_entries_are_ignored_visibly
FAILED tests/test_i2_manifest.py::test_a_vanishing_directory_teaches_instead_of_partial_manifest
FAILED tests/test_i2_manifest.py::test_run_human_line_reports_counts_and_size
FAILED tests/test_i2_manifest.py::test_json_run_emits_manifest_compare_and_schema
FAILED tests/test_i3a_json.py::test_missing_source_is_json_1_kind_source - As...
FAILED tests/test_i5a_cron.py::test_cron_line_uses_an_absolute_binary - Asser...
FAILED tests/test_i7b_reconciliation.py::test_fake_restic_failures_exit_1_and_speak_restic_words[fail_restore]
FAILED tests/test_i7b_reconciliation.py::test_fake_restic_failures_exit_1_and_speak_restic_words[no_such_repo]
FAILED tests/test_i7b_reconciliation.py::test_fake_restic_failures_exit_1_and_speak_restic_words[wrong_password]
FAILED tests/test_i7b_reconciliation.py::test_source_walk_prunes_exactly_what_restic_pruned
