.....................................................F.............. [ 91%]
......                                                             [100%]
=================================== FAILURES ===================================
_ Phase15CActionContractTests.test_registry_identity_and_inventories_are_exact _
tests/test_phase15c_action_contract.py:254: in test_registry_identity_and_inventories_are_exact
    self.assertEqual(len(ACTION_SPECS), 83)
E   AssertionError: 84 != 83
_ Phase15CQtWorkspaceIntegrationTests.test_integration_modules_are_bounded_and_parseable (relative='pycforge/ide/qt_window_chrome.py') _
tests/test_phase15c_qt_workspace_integration.py:899: in test_integration_modules_are_bounded_and_parseable
    self.assertLess(len(source.splitlines()), 600)
E   AssertionError: 641 not less than 600
=============================== warnings summary ===============================
tests/test_clipboard_1_3_56.py::test_c_copy_works_but_typing_cut_paste_and_drop_cannot_edit_it
  /workspace/scratch/0d3add869376/clipboard-1.3.56/pycforge-1.3.56/tests/test_clipboard_1_3_56.py:197: DeprecationWarning: Function: 'QDragEnterEvent.QDragEnterEvent(const QPoint &pos, QFlags<Qt.DropAction> actions, const QMimeData *data, QFlags<Qt.MouseButton> buttons, QFlags<Qt.KeyboardModifier> modifiers)' is marked as deprecated, please check the documentation for more information.
    enter=QDragEnterEvent(QPoint(5,5),Qt.DropAction.CopyAction,data,Qt.MouseButton.LeftButton,Qt.KeyboardModifier.NoModifier)

-- Docs: https://docs.pytest.org/en/stable/how-to/capture-warnings.html
=========================== short test summary info ============================
FAILED tests/test_phase15c_action_contract.py::Phase15CActionContractTests::test_registry_identity_and_inventories_are_exact
SUBFAILED(relative='pycforge/ide/qt_window_chrome.py') tests/test_phase15c_qt_workspace_integration.py::Phase15CQtWorkspaceIntegrationTests::test_integration_modules_are_bounded_and_parseable
2 failed, 73 passed, 1 warning, 369 subtests passed in 5.54s
