F
=================================== FAILURES ===================================
_ Phase15AReleasePackagingTests.test_converter_subtree_preserves_checkpoint_e_and_records_phase16 _
tests/test_phase15a_release_packaging.py:137: in test_converter_subtree_preserves_checkpoint_e_and_records_phase16
    self.assertEqual(
E   AssertionError: 144 != 135
=========================== short test summary info ============================
FAILED tests/test_phase15a_release_packaging.py::Phase15AReleasePackagingTests::test_converter_subtree_preserves_checkpoint_e_and_records_phase16
!!!!!!!!!!!!!!!!!!!!!!!!!! stopping after 1 failures !!!!!!!!!!!!!!!!!!!!!!!!!!!
1 failed in 0.71s
