s.F..........F.....                                         [100%]
=================================== FAILURES ===================================
____ Phase15AValidatorTests.test_converter_hash_changes_on_one_byte_tamper _____
tests/test_validate_phase15a.py:120: in test_converter_hash_changes_on_one_byte_tamper
    self.assertEqual(active_count, 135)
E   AssertionError: 144 != 135
_ Phase15AValidatorTests.test_phase16_identities_and_converter_subtree_fail_historical_gate _
tests/test_validate_phase15a.py:103: in test_phase16_identities_and_converter_subtree_fail_historical_gate
    self.assertEqual(subtree["file_count"], 135)
E   AssertionError: 144 != 135
----------------------------- Captured stdout call -----------------------------
uuuuu
=========================== short test summary info ============================
SKIPPED [1] tests/test_validate_phase15a.py:228: optional sealed Checkpoint E archive is unavailable
2 failed, 16 passed, 1 skipped, 13 subtests passed in 15.26s
