.................................................................................      [100%]
=================================== FAILURES ===================================
_ Phase15CQtWorkspaceIntegrationTests.test_integration_modules_are_bounded_and_parseable (relative='pycforge/ide/qt_workspace_features.py') _
tests/test_phase15c_qt_workspace_integration.py:897: in test_integration_modules_are_bounded_and_parseable
    self.assertLess(len(source.splitlines()), 600)
E   AssertionError: 602 not less than 600
=========================== short test summary info ============================
SUBFAILED(relative='pycforge/ide/qt_workspace_features.py') tests/test_phase15c_qt_workspace_integration.py::Phase15CQtWorkspaceIntegrationTests::test_integration_modules_are_bounded_and_parseable
1 failed, 81 passed, 561 subtests passed in 10.06s
