pids before=247
FFF..F....FFF......FF.F...F.........FF....FFFF.........                  [100%]
=================================== FAILURES ===================================
E   assert ('E_RUNTIME_SYMBOLS: the isolated probe could not be started (/work/t_a696ce02/repo/.venv/bin/python -m ggufone.runtime...shared pid cgroup at its cap, not a bundle problem); retry when pids.current is lower, or give the container more pids' and 'cannot load' in 'E_RUNTIME_SYMBOLS: the isolated probe could not be started (/work/t_a696ce02/repo/.venv/bin/python -m ggufone.runtime...shared pid cgroup at its cap, not a bundle problem); retry when pids.current is lower, or give the container more pids')
     +  where 'E_RUNTIME_SYMBOLS: the isolated probe could not be started (/work/t_a696ce02/repo/.venv/bin/python -m ggufone.runtime...shared pid cgroup at its cap, not a bundle problem); retry when pids.current is lower, or give the container more pids' = ProbeResult(runtime_dir=PosixPath('/tmp/pytest-of-root/pytest-2272/test_deep_probe_does_not_dlope0/runtime'), deep=Tru...hared pid cgroup at its cap, not a bundle problem); retry when pids.current is lower, or give the container more pids").error
     +  and   'E_RUNTIME_SYMBOLS: the isolated probe could not be started (/work/t_a696ce02/repo/.venv/bin/python -m ggufone.runtime...shared pid cgroup at its cap, not a bundle problem); retry when pids.current is lower, or give the container more pids' = ProbeResult(runtime_dir=PosixPath('/tmp/pytest-of-root/pytest-2272/test_deep_probe_does_not_dlope0/runtime'), deep=Tru...hared pid cgroup at its cap, not a bundle problem); retry when pids.current is lower, or give the container more pids").error
/work/t_a696ce02/repo/tests/test_probe_isolation.py:97: assert ('E_RUNTIME_SYMBOLS: the isolated probe could not be started (/work/t_a696ce02/repo/.venv/bin/python -m ggufone.runtime...shared pid cgroup at its cap, not a bundle problem); retry when pids.current is lower, or give the container more pids' and 'cannot load' in 'E_RUNTIME_SYMBOLS: the isolated probe could not be started (/work/t_a696ce02/repo/.venv/bin/python -m ggufone.runtime...shared pid cgroup at its cap, not a bundle problem); retry when pids.current is lower, or give the container more pids')
E   assert 'E_RUNTIME_SYMBOLS: the isolated probe could not be started (/work/t_a696ce02/repo/.venv/bin/python -m ggufone.runtime...shared pid cgroup at its cap, not a bundle problem); retry when pids.current is lower, or give the container more pids' is None
     +  where 'E_RUNTIME_SYMBOLS: the isolated probe could not be started (/work/t_a696ce02/repo/.venv/bin/python -m ggufone.runtime...shared pid cgroup at its cap, not a bundle problem); retry when pids.current is lower, or give the container more pids' = ProbeResult(runtime_dir=PosixPath('/tmp/pytest-of-root/pytest-2272/test_the_child_really_loads_th0/runtime'), deep=Tru...hared pid cgroup at its cap, not a bundle problem); retry when pids.current is lower, or give the container more pids").error
/work/t_a696ce02/repo/tests/test_probe_isolation.py:113: assert 'E_RUNTIME_SYMBOLS: the isolated probe could not be started (/work/t_a696ce02/repo/.venv/bin/python -m ggufone.runtime...shared pid cgroup at its cap, not a bundle problem); retry when pids.current is lower, or give the container more pids' is None
E   BlockingIOError: [Errno 11] Resource temporarily unavailable
/work/t_a696ce02/inject.py:33: BlockingIOError: [Errno 11] Resource temporarily unavailable
E   assert ('E_RUNTIME_SYMBOLS: the isolated probe could not be started (/work/t_a696ce02/repo/.venv/bin/python -c import time; ti...shared pid cgroup at its cap, not a bundle problem); retry when pids.current is lower, or give the container more pids' and 'timed out' in 'E_RUNTIME_SYMBOLS: the isolated probe could not be started (/work/t_a696ce02/repo/.venv/bin/python -c import time; ti...shared pid cgroup at its cap, not a bundle problem); retry when pids.current is lower, or give the container more pids')
     +  where 'E_RUNTIME_SYMBOLS: the isolated probe could not be started (/work/t_a696ce02/repo/.venv/bin/python -c import time; ti...shared pid cgroup at its cap, not a bundle problem); retry when pids.current is lower, or give the container more pids' = ProbeResult(runtime_dir=PosixPath('/tmp/pytest-of-root/pytest-2272/test_a_probe_child_that_hangs_0/runtime'), deep=Tru...hared pid cgroup at its cap, not a bundle problem); retry when pids.current is lower, or give the container more pids").error
     +  and   'E_RUNTIME_SYMBOLS: the isolated probe could not be started (/work/t_a696ce02/repo/.venv/bin/python -c import time; ti...shared pid cgroup at its cap, not a bundle problem); retry when pids.current is lower, or give the container more pids' = ProbeResult(runtime_dir=PosixPath('/tmp/pytest-of-root/pytest-2272/test_a_probe_child_that_hangs_0/runtime'), deep=Tru...hared pid cgroup at its cap, not a bundle problem); retry when pids.current is lower, or give the container more pids").error
/work/t_a696ce02/repo/tests/test_probe_isolation.py:166: assert ('E_RUNTIME_SYMBOLS: the isolated probe could not be started (/work/t_a696ce02/repo/.venv/bin/python -c import time; ti...shared pid cgroup at its cap, not a bundle problem); retry when pids.current is lower, or give the container more pids' and 'timed out' in 'E_RUNTIME_SYMBOLS: the isolated probe could not be started (/work/t_a696ce02/repo/.venv/bin/python -c import time; ti...shared pid cgroup at its cap, not a bundle problem); retry when pids.current is lower, or give the container more pids')
E   socket.gaierror: [Errno -2] Name or service not known

During handling of the above exception, another exception occurred:
E   urllib.error.URLError: <urlopen error [Errno -2] Name or service not known>

The above exception was the direct cause of the following exception:
E   ggufone.errors.DownloadError: E_DOWNLOAD_FAILED: https://example.invalid/releases/download/b11026/llama-b11026-bin-ubuntu-x64.tar.gz: cannot reach huggingface.co (<urlopen error [Errno -2] Name or service not known>); this tool is offline-capable only for the pinned default model (GGUFONE_OFFLINE=1)
/work/t_a696ce02/repo/src/ggufone/registry/hf.py:307: ggufone.errors.DownloadError: E_DOWNLOAD_FAILED: https://example.invalid/releases/download/b11026/llama-b11026-bin-ubuntu-x64.tar.gz: cannot reach huggingface.co (<urlopen error [Errno -2] Name or service not known>); this tool is offline-capable only for the pinned default model (GGUFONE_OFFLINE=1)
E   AssertionError: assert 3 == 0
     +  where 3 = <function main at 0x7f12f81198a0>(['init', '--json'])
     +    where <function main at 0x7f12f81198a0> = cli.main
----------------------------- Captured stderr call -----------------------------
error: E_DOWNLOAD_FAILED: https://example.invalid/releases/download/b11026/llama-b11026-bin-ubuntu-x64.tar.gz: cannot reach huggingface.co (<urlopen error [Errno -2] Name or service not known>); this tool is offline-capable only for the pinned default model (GGUFONE_OFFLINE=1)
/work/t_a696ce02/repo/tests/test_probe_isolation.py:306: AssertionError: assert 3 == 0
E   AssertionError: assert 3 == 0
     +  where 3 = <function main at 0x7f12f81198a0>(['init', '--json'])
     +    where <function main at 0x7f12f81198a0> = cli.main
----------------------------- Captured stderr call -----------------------------
error: E_DOWNLOAD_FAILED: https://example.invalid/releases/download/b11026/llama-b11026-bin-ubuntu-x64.tar.gz: cannot reach huggingface.co (<urlopen error [Errno -2] Name or service not known>); this tool is offline-capable only for the pinned default model (GGUFONE_OFFLINE=1)
/work/t_a696ce02/repo/tests/test_probe_isolation.py:340: AssertionError: assert 3 == 0
E   BlockingIOError: [Errno 11] Resource temporarily unavailable
/work/t_a696ce02/inject.py:33: BlockingIOError: [Errno 11] Resource temporarily unavailable
E   AssertionError: assert 'the isolated probe could not be started (/work/t_a696ce02/repo/.venv/bin/python -m ggufone.runtime.probe_child): E_PI...shared pid cgroup at its cap, not a bundle problem); retry when pids.current is lower, or give the container more pids' is None
/work/t_a696ce02/repo/tests/test_probe_isolation.py:504: AssertionError: assert 'the isolated probe could not be started (/work/t_a696ce02/repo/.venv/bin/python -m ggufone.runtime.probe_child): E_PI...shared pid cgroup at its cap, not a bundle problem); retry when pids.current is lower, or give the container more pids' is None
E   assert 'E_RUNTIME_SYMBOLS: the isolated probe could not be started (/work/t_a696ce02/repo/.venv/bin/python -m ggufone.runtime...shared pid cgroup at its cap, not a bundle problem); retry when pids.current is lower, or give the container more pids' is None
     +  where 'E_RUNTIME_SYMBOLS: the isolated probe could not be started (/work/t_a696ce02/repo/.venv/bin/python -m ggufone.runtime...shared pid cgroup at its cap, not a bundle problem); retry when pids.current is lower, or give the container more pids' = ProbeResult(runtime_dir=PosixPath('/tmp/pytest-of-root/pytest-2272/test_the_child_reports_symbols0/runtime'), deep=Tru...hared pid cgroup at its cap, not a bundle problem); retry when pids.current is lower, or give the container more pids").error
/work/t_a696ce02/repo/tests/test_probe_isolation.py:544: assert 'E_RUNTIME_SYMBOLS: the isolated probe could not be started (/work/t_a696ce02/repo/.venv/bin/python -m ggufone.runtime...shared pid cgroup at its cap, not a bundle problem); retry when pids.current is lower, or give the container more pids' is None
E   AssertionError: assert None == 11026
     +  where None = <function build_number at 0x7f12f7e00e00>(PosixPath('/tmp/pytest-of-root/pytest-2272/test_build_number_reads_llama_0/runtime'))
     +    where <function build_number at 0x7f12f7e00e00> = capability.build_number
/work/t_a696ce02/repo/tests/test_capability.py:73: AssertionError: assert None == 11026
E   AssertionError: assert None == 11026
     +  where None = ProbeResult(runtime_dir=PosixPath('/tmp/pytest-of-root/pytest-2272/test_probe_is_deep_by_default_0/runtime'), deep=Fal..._by_default_0/runtime/llama-fit-params'}, fit_params_help_exit=None, expect_backend=None, error=None, child_error=None).build
/work/t_a696ce02/repo/tests/test_capability.py:144: AssertionError: assert None == 11026
E   assert 'E_RUNTIME_SYMBOLS: the isolated probe could not be started (/work/t_a696ce02/repo/.venv/bin/python -m ggufone.runtime...shared pid cgroup at its cap, not a bundle problem); retry when pids.current is lower, or give the container more pids' is None
     +  where 'E_RUNTIME_SYMBOLS: the isolated probe could not be started (/work/t_a696ce02/repo/.venv/bin/python -m ggufone.runtime...shared pid cgroup at its cap, not a bundle problem); retry when pids.current is lower, or give the container more pids' = ProbeResult(runtime_dir=PosixPath('/tmp/pytest-of-root/pytest-2272/test_deep_probe_reports_symbol0/runtime'), deep=Tru...hared pid cgroup at its cap, not a bundle problem); retry when pids.current is lower, or give the container more pids").error
/work/t_a696ce02/repo/tests/test_capability.py:152: assert 'E_RUNTIME_SYMBOLS: the isolated probe could not be started (/work/t_a696ce02/repo/.venv/bin/python -m ggufone.runtime...shared pid cgroup at its cap, not a bundle problem); retry when pids.current is lower, or give the container more pids' is None
E   AssertionError: assert None == 0
     +  where None = ProbeResult(runtime_dir=PosixPath('/tmp/pytest-of-root/pytest-2272/test_probe_records_the_tool_ch0/runtime'), deep=Fal..._the_tool_ch0/runtime/llama-fit-params'}, fit_params_help_exit=None, expect_backend=None, error=None, child_error=None).fit_params_help_exit
/work/t_a696ce02/repo/tests/test_capability.py:187: AssertionError: assert None == 0
E   AssertionError: assert None == 3
     +  where None = ProbeResult(runtime_dir=PosixPath('/tmp/pytest-of-root/pytest-2272/test_probe_fails_when_fit_para0/runtime'), deep=Fal...hen_fit_para0/runtime/llama-fit-params'}, fit_params_help_exit=None, expect_backend=None, error=None, child_error=None).fit_params_help_exit
/work/t_a696ce02/repo/tests/test_capability.py:194: AssertionError: assert None == 3
E   assert False
     +  where False = any(<generator object test_probe_fails_when_build_is_below_the_spark2_5_floor.<locals>.<genexpr> at 0x7f12f8155970>)
/work/t_a696ce02/repo/tests/test_capability.py:201: assert False
E   AssertionError: assert None == 12000
     +  where None = ProbeResult(runtime_dir=PosixPath('/tmp/pytest-of-root/pytest-2272/test_probe_warns_when_the_buil0/runtime'), deep=Fal...hen_the_buil0/runtime/llama-fit-params'}, fit_params_help_exit=None, expect_backend=None, error=None, child_error=None).build
/work/t_a696ce02/repo/tests/test_capability.py:207: AssertionError: assert None == 12000
=========================== short test summary info ============================
FAILED tests/test_probe_isolation.py::test_deep_probe_does_not_dlopen_anything_in_this_process
FAILED tests/test_probe_isolation.py::test_the_child_really_loads_the_bundle
FAILED tests/test_probe_isolation.py::test_the_probe_child_answers_the_documented_protocol
FAILED tests/test_probe_isolation.py::test_a_probe_child_that_hangs_times_out
FAILED tests/test_probe_isolation.py::test_already_installed_reports_the_recorded_fallback_reason
FAILED tests/test_probe_isolation.py::test_cli_init_on_an_installed_runtime_prints_the_fallback_reason
FAILED tests/test_probe_isolation.py::test_init_without_a_record_names_the_backend_this_run_asked_for
FAILED tests/test_probe_isolation.py::test_warmup_child_answers_the_documented_protocol
FAILED tests/test_probe_isolation.py::test_system_lib_probe_reports_what_this_host_can_load
FAILED tests/test_probe_isolation.py::test_the_child_reports_symbols_and_backends_in_one_answer
FAILED tests/test_capability.py::test_build_number_reads_llama_cli - Assertio...
FAILED tests/test_capability.py::test_probe_is_deep_by_default_and_shallow_on_request
FAILED tests/test_capability.py::test_deep_probe_reports_symbols_missing_from_a_real_but_wrong_library
FAILED tests/test_capability.py::test_probe_records_the_tool_checks - Asserti...
FAILED tests/test_capability.py::test_probe_fails_when_fit_params_help_breaks
FAILED tests/test_capability.py::test_probe_fails_when_build_is_below_the_spark2_5_floor
FAILED tests/test_capability.py::test_probe_warns_when_the_build_is_not_the_pinned_tag
17 failed, 38 passed in 0.51s
exit=1
pids after=247
