[run-exclusive] pr8c-red-parent starting; load was 1.88
#258 before=5fb8a80 rc=1 38 failed, 13 passed, 29 warnings in 2.18s
    collection_error=False raised=['AssertionError']
    files existed before: {'tests/test_tuning/test_direction_reconciliation.py': False, 'tests/_train_spy.py': True, 'tests/_ast_scan.py': True, 'tests/test_data/_hostile_arrays.py': False, 'tests/test_config/_knob_registry.py': False, 'tests/test_persistence/_load_census.py': False, 'tests/test_docs/__init__.py': True}
#259 before=2d3bc54 rc=1 5 failed, 1 passed in 1.08s
    collection_error=False raised=['AttributeError']
    files existed before: {'tests/test_features/test_pipeline_conformance.py': False, 'tests/_train_spy.py': True, 'tests/_ast_scan.py': True, 'tests/test_data/_hostile_arrays.py': False, 'tests/test_config/_knob_registry.py': False, 'tests/test_persistence/_load_census.py': False, 'tests/test_docs/__init__.py': True}
#260 before=2d3bc54 rc=1 25 failed, 2 passed in 1.16s
    collection_error=False raised=['AssertionError', 'KeyError']
    files existed before: {'tests/test_features/test_unseen_policy.py': False, 'tests/test_codegen/test_unseen_policy_codegen.py': False, 'tests/_train_spy.py': True, 'tests/_ast_scan.py': True, 'tests/test_data/_hostile_arrays.py': False, 'tests/test_config/_knob_registry.py': False, 'tests/test_persistence/_load_census.py': False, 'tests/test_docs/__init__.py': True}
#261 before=1d7c4e2 rc=1 14 failed, 25 passed, 10 warnings in 1.30s
    collection_error=False raised=['AssertionError', 'AttributeError']
    files existed before: {'tests/test_estimators/test_lightgbm_parameter_names.py': False, 'tests/_train_spy.py': False, 'tests/_ast_scan.py': False, 'tests/test_data/_hostile_arrays.py': False, 'tests/test_config/_knob_registry.py': False, 'tests/test_persistence/_load_census.py': False, 'tests/test_docs/__init__.py': True}
#262 before=1d7c4e2 rc=1 18 failed, 10 passed, 9 xfailed, 24 warnings in 2.01s
    collection_error=False raised=[]
    files existed before: {'tests/test_tuning/test_search_space_name_validation.py': False, 'tests/_train_spy.py': False, 'tests/_ast_scan.py': False, 'tests/test_data/_hostile_arrays.py': False, 'tests/test_config/_knob_registry.py': False, 'tests/test_persistence/_load_census.py': False, 'tests/test_docs/__init__.py': True}
#263 before=1abf7fb rc=1 6 failed, 18 passed, 4 warnings in 1.14s
    collection_error=False raised=['AssertionError', 'ValueError']
    files existed before: {'tests/test_core/test_error_code_raising.py': False, 'tests/test_core/test_error_code_population.py': False, 'tests/test_docs/test_error_code_docs.py': False, 'tests/_train_spy.py': True, 'tests/_ast_scan.py': True, 'tests/test_data/_hostile_arrays.py': False, 'tests/test_config/_knob_registry.py': False, 'tests/test_persistence/_load_census.py': False, 'tests/test_docs/__init__.py': True}
#264 before=ccae32b rc=2 1 error in 0.87s
    collection_error=True raised=['ImportError']
    files existed before: {'tests/test_core/test_fit_params_override.py': False, 'tests/_train_spy.py': False, 'tests/_ast_scan.py': True, 'tests/test_data/_hostile_arrays.py': False, 'tests/test_config/_knob_registry.py': False, 'tests/test_persistence/_load_census.py': False, 'tests/test_docs/__init__.py': True}
#265 before=3abb6c4 rc=0 9 passed in 0.73s
    collection_error=False raised=[]
    files existed before: {'tests/test_training/test_inner_valid_purge_embargo.py': True, 'tests/_train_spy.py': False, 'tests/_ast_scan.py': False, 'tests/test_data/_hostile_arrays.py': False, 'tests/test_config/_knob_registry.py': False, 'tests/test_persistence/_load_census.py': False, 'tests/test_docs/__init__.py': False}
#266 before=3abb6c4 rc=1 4 failed, 9 passed in 0.77s
    collection_error=False raised=['AssertionError']
    files existed before: {'tests/test_docs/test_declared_versions.py': False, 'tests/_train_spy.py': False, 'tests/_ast_scan.py': False, 'tests/test_data/_hostile_arrays.py': False, 'tests/test_config/_knob_registry.py': False, 'tests/test_persistence/_load_census.py': False, 'tests/test_docs/__init__.py': False}
#267 before=97381db rc=1 34 failed, 3 passed in 2.86s
    collection_error=False raised=['AssertionError', 'OverflowError']
    files existed before: {'tests/test_data/test_leakage_validator_unchecked_column.py': False, 'tests/_train_spy.py': True, 'tests/_ast_scan.py': True, 'tests/test_data/_hostile_arrays.py': False, 'tests/test_config/_knob_registry.py': False, 'tests/test_persistence/_load_census.py': False, 'tests/test_docs/__init__.py': True}
#268 before=91a698b rc=1 1 failed, 86 passed, 29 warnings in 5.69s
    collection_error=False raised=['ValueError']
    files existed before: {'tests/test_config/test_knob_reachability.py': False, 'tests/_train_spy.py': True, 'tests/_ast_scan.py': True, 'tests/test_data/_hostile_arrays.py': True, 'tests/test_config/_knob_registry.py': False, 'tests/test_persistence/_load_census.py': False, 'tests/test_docs/__init__.py': True}
#269 before=96171da rc=1 7 failed, 6 passed, 9 warnings in 1.43s
    collection_error=False raised=['AssertionError']
    files existed before: {'tests/test_training/test_cv_refit_parity.py': False, 'tests/_train_spy.py': True, 'tests/_ast_scan.py': True, 'tests/test_data/_hostile_arrays.py': False, 'tests/test_config/_knob_registry.py': False, 'tests/test_persistence/_load_census.py': False, 'tests/test_docs/__init__.py': True}
#270 before=1d7c4e2 rc=2 1 error in 0.77s
    collection_error=True raised=['ModuleNotFoundError']
    files existed before: {'tests/test_estimators/test_param_behavioral_effect.py': True, 'tests/test_core/test_config_propagation.py': True, 'tests/_train_spy.py': False, 'tests/_ast_scan.py': False, 'tests/test_data/_hostile_arrays.py': False, 'tests/test_config/_knob_registry.py': False, 'tests/test_persistence/_load_census.py': False, 'tests/test_docs/__init__.py': True}
#272 before=1abf7fb rc=1 20 failed, 36 passed in 0.80s
    collection_error=False raised=['ImportError', 'OverflowError']
    files existed before: {'tests/test_config/test_config_version_entry_paths.py': False, 'tests/_train_spy.py': True, 'tests/_ast_scan.py': True, 'tests/test_data/_hostile_arrays.py': False, 'tests/test_config/_knob_registry.py': False, 'tests/test_persistence/_load_census.py': False, 'tests/test_docs/__init__.py': True}
#277 before=5ac725e rc=2 2 errors in 0.83s
    collection_error=True raised=['ModuleNotFoundError']
    files existed before: {'tests/test_core/test_calibration_params_reach.py': False, 'tests/test_calibration/test_calibration_param_contract.py': False, 'tests/test_calibration/test_platt_mle.py': False, 'tests/test_codegen/test_calibration_params_codegen.py': False, 'tests/_train_spy.py': True, 'tests/_ast_scan.py': True, 'tests/test_data/_hostile_arrays.py': False, 'tests/test_config/_knob_registry.py': False, 'tests/test_persistence/_load_census.py': False, 'tests/test_docs/__init__.py': True}
#279 before=5fb8a80 rc=1 22 failed, 1 passed, 24 warnings in 0.90s
    collection_error=False raised=['AssertionError']
    files existed before: {'tests/test_tuning/test_dimension_consumption.py': False, 'tests/_train_spy.py': True, 'tests/_ast_scan.py': True, 'tests/test_data/_hostile_arrays.py': False, 'tests/test_config/_knob_registry.py': False, 'tests/test_persistence/_load_census.py': False, 'tests/test_docs/__init__.py': True}
#281 before=036cd18 rc=1 37 failed, 3 passed, 101 warnings in 7.24s
    collection_error=False raised=['AssertionError', 'KeyError']
    files existed before: {'tests/test_persistence/test_reporting_surfaces_survive_load.py': False, 'tests/test_persistence/test_applied_training_params.py': False, 'tests/_train_spy.py': True, 'tests/_ast_scan.py': True, 'tests/test_data/_hostile_arrays.py': True, 'tests/test_config/_knob_registry.py': True, 'tests/test_persistence/_load_census.py': False, 'tests/test_docs/__init__.py': True}
#282 before=5fb8a80 rc=1 22 failed, 1 passed, 24 warnings in 0.92s
    collection_error=False raised=['AssertionError']
    files existed before: {'tests/test_tuning/test_dimension_consumption.py': False, 'tests/_train_spy.py': True, 'tests/_ast_scan.py': True, 'tests/test_data/_hostile_arrays.py': False, 'tests/test_config/_knob_registry.py': False, 'tests/test_persistence/_load_census.py': False, 'tests/test_docs/__init__.py': True}
#284 before=2436a66 rc=0 2 passed in 0.71s
    collection_error=False raised=[]
    files existed before: {'tests/test_core/test_param_domain_cycles.py': False, 'tests/_train_spy.py': True, 'tests/_ast_scan.py': True, 'tests/test_data/_hostile_arrays.py': False, 'tests/test_config/_knob_registry.py': False, 'tests/test_persistence/_load_census.py': False, 'tests/test_docs/__init__.py': True}
#285 before=53f6cbf rc=1 15 failed, 7 passed, 8 warnings in 0.95s
    collection_error=False raised=['AttributeError', 'KeyError']
    files existed before: {'tests/test_core/test_param_refusal_origin.py': False, 'tests/_train_spy.py': True, 'tests/_ast_scan.py': True, 'tests/test_data/_hostile_arrays.py': False, 'tests/test_config/_knob_registry.py': False, 'tests/test_persistence/_load_census.py': False, 'tests/test_docs/__init__.py': True}
#287 before=2436a66 rc=0 8 passed in 0.73s
    collection_error=False raised=[]
    files existed before: {'tests/test_tuning/test_literal_domain_contract.py': False, 'tests/_train_spy.py': True, 'tests/_ast_scan.py': True, 'tests/test_data/_hostile_arrays.py': False, 'tests/test_config/_knob_registry.py': False, 'tests/test_persistence/_load_census.py': False, 'tests/test_docs/__init__.py': True}
#288 before=ccae32b rc=2 1 error in 0.84s
    collection_error=True raised=['ImportError']
    files existed before: {'tests/test_core/test_fit_params_override.py': False, 'tests/_train_spy.py': False, 'tests/_ast_scan.py': True, 'tests/test_data/_hostile_arrays.py': False, 'tests/test_config/_knob_registry.py': False, 'tests/test_persistence/_load_census.py': False, 'tests/test_docs/__init__.py': True}
#306 before=fc9d820 rc=1 19 failed, 44 passed, 5 warnings in 2.23s
    collection_error=False raised=['AssertionError', 'ValueError']
    files existed before: {'tests/test_estimators/test_feval_probabilities.py': False, 'tests/_train_spy.py': True, 'tests/_ast_scan.py': True, 'tests/test_data/_hostile_arrays.py': False, 'tests/test_config/_knob_registry.py': False, 'tests/test_persistence/_load_census.py': False, 'tests/test_docs/__init__.py': True}
[run-exclusive] pr8c-red-parent finished in 45s, exit 0

[exited with code 0]
