FAILED tests/test_codegen/test_calibration_params_codegen.py::test_generated_fitter_matches_the_runtime_calibrator[platt-params1]
FAILED tests/test_config/test_knob_reachability.py::test_api_rows_reach_the_constructor
FAILED tests/test_core/test_param_domain.py::test_a_value_with_no_plain_stand_in_is_refused_rather_than_rounded
FAILED tests/test_core/test_param_domain.py::test_unchanged_is_decided_by_type_and_not_by_printed_text
FAILED tests/test_docs/test_phase3_gap.py::test_an_unused_import_of_a_new_module_is_not_red
FAILED tests/test_docs/test_phase3_gap.py::test_staging_cannot_manufacture_red[round-2-guarded-import]
FAILED tests/test_docs/test_phase3_gap.py::test_staging_cannot_manufacture_red[round-3-relative-import-module]
FAILED tests/test_docs/test_phase3_gap.py::test_staging_cannot_manufacture_red[round-4-explicit-package]
FAILED tests/test_docs/test_phase3_gap.py::test_staging_cannot_manufacture_red[round-4-fromlist]
FAILED tests/test_docs/test_phase3_gap.py::test_staging_cannot_manufacture_red[round-5-relative-dunder-import]
FAILED tests/test_docs/test_phase3_gap.py::test_staging_cannot_manufacture_red[round-6-all-slice-assignment]
FAILED tests/test_docs/test_phase3_gap.py::test_staging_cannot_manufacture_red[round-6-nested-exec]
FAILED tests/test_docs/test_phase3_gap.py::test_staging_cannot_manufacture_red[runtime-built-name]
FAILED tests/test_docs/test_phase3_gap.py::test_an_unrelated_test_is_not_red_under_a_mutation
FAILED tests/test_docs/test_phase3_gap.py::test_a_skip_in_a_real_run_is_seen
FAILED tests/test_docs/test_phase3_gap.py::test_a_collection_error_in_a_real_run_is_an_error_case
FAILED tests/test_plots/test_tuning_plot_rounds.py::test_separators_follow_trial_rounds_failed_round_1
FAILED tests/test_plots/test_tuning_plot_rounds.py::test_tuning_table_round_column[failed_round_1]
FAILED tests/test_plots/test_tuning_plot_rounds.py::test_tuning_table_round_column[two_rounds]
FAILED tests/test_tuning/test_expansion_never_narrows.py::test_user_range_below_bound_is_not_inverted
FAILED tests/test_tuning/test_h0125_tune_value_admission.py::test_model_params_value_is_refused_before_any_study[binary-objective-'cross_entropy_lambda']
FAILED tests/test_tuning/test_h0125_tune_value_admission.py::test_model_params_value_is_refused_before_any_study[binary-objective_type-'cross_entropy_lambda']
FAILED tests/test_tuning/test_h0125_tune_value_admission.py::test_model_params_value_is_refused_before_any_study[binary-app-'cross_entropy_lambda']
FAILED tests/test_tuning/test_h0125_tune_value_admission.py::test_model_params_value_is_refused_before_any_study[binary-application-'cross_entropy_lambda']
FAILED tests/test_tuning/test_h0125_tune_value_admission.py::test_model_params_value_is_refused_before_any_study[binary-loss-'cross_entropy_lambda']
FAILED tests/test_tuning/test_h0125_tune_value_admission.py::test_model_params_value_is_refused_before_any_study[binary-objective-'regression']
FAILED tests/test_tuning/test_h0125_tune_value_admission.py::test_model_params_value_is_refused_before_any_study[regression-objective-'binary']
FAILED tests/test_tuning/test_h0125_tune_value_admission.py::test_model_params_value_is_refused_before_any_study[regression-metric-[{'huber': {'delta': 9.0}}]]
FAILED tests/test_tuning/test_h0125_tune_value_admission.py::test_model_params_value_is_refused_before_any_study[regression-metrics-[{'huber': {'delta': 9.0}}]]
FAILED tests/test_tuning/test_h0125_tune_value_admission.py::test_model_params_value_is_refused_before_any_study[regression-metric_types-[{'huber': {'delta': 9.0}}]]
FAILED tests/test_tuning/test_h0125_tune_value_admission.py::test_model_params_value_is_refused_before_any_study[regression-metric-['auc']]
FAILED tests/test_tuning/test_h0125_tune_value_admission.py::test_model_params_value_is_refused_before_any_study[binary-metric-'rmse']
FAILED tests/test_tuning/test_h0125_tune_value_admission.py::test_fixed_layer_value_is_refused_before_any_study
FAILED tests/test_tuning/test_h0125_tune_value_admission.py::test_config_space_dimension_is_refused_before_any_study[replace-binary-objective-categorical]
FAILED tests/test_tuning/test_h0125_tune_value_admission.py::test_config_space_dimension_is_refused_before_any_study[replace-binary-objective_type-categorical]
FAILED tests/test_tuning/test_h0125_tune_value_admission.py::test_config_space_dimension_is_refused_before_any_study[replace-binary-application-categorical]
FAILED tests/test_tuning/test_h0125_tune_value_admission.py::test_config_space_dimension_is_refused_before_any_study[replace-regression-loss-categorical]
FAILED tests/test_tuning/test_h0125_tune_value_admission.py::test_config_space_dimension_is_refused_before_any_study[replace-binary-metric-categorical]
FAILED tests/test_tuning/test_h0125_tune_value_admission.py::test_config_space_dimension_is_refused_before_any_study[replace-regression-metrics-categorical]
FAILED tests/test_tuning/test_h0125_tune_value_admission.py::test_config_space_dimension_is_refused_before_any_study[replace-multiclass-metric_types-categorical]
FAILED tests/test_tuning/test_h0125_tune_value_admission.py::test_config_space_dimension_is_refused_before_any_study[replace-binary-objective-int]
FAILED tests/test_tuning/test_h0125_tune_value_admission.py::test_config_space_dimension_is_refused_before_any_study[replace-regression-metric-float]
FAILED tests/test_tuning/test_h0125_tune_value_admission.py::test_config_space_dimension_is_refused_before_any_study[replace-binary-app-int]
FAILED tests/test_tuning/test_h0125_tune_value_admission.py::test_config_space_dimension_is_refused_before_any_study[merge-binary-objective-categorical]
FAILED tests/test_tuning/test_h0125_tune_value_admission.py::test_config_space_dimension_is_refused_before_any_study[merge-binary-objective_type-categorical]
FAILED tests/test_tuning/test_h0125_tune_value_admission.py::test_config_space_dimension_is_refused_before_any_study[merge-binary-application-categorical]
FAILED tests/test_tuning/test_h0125_tune_value_admission.py::test_config_space_dimension_is_refused_before_any_study[merge-regression-loss-categorical]
FAILED tests/test_tuning/test_h0125_tune_value_admission.py::test_config_space_dimension_is_refused_before_any_study[merge-binary-metric-categorical]
FAILED tests/test_tuning/test_h0125_tune_value_admission.py::test_config_space_dimension_is_refused_before_any_study[merge-regression-metrics-categorical]
FAILED tests/test_tuning/test_h0125_tune_value_admission.py::test_config_space_dimension_is_refused_before_any_study[merge-multiclass-metric_types-categorical]
FAILED tests/test_tuning/test_h0125_tune_value_admission.py::test_config_space_dimension_is_refused_before_any_study[merge-binary-objective-int]
FAILED tests/test_tuning/test_h0125_tune_value_admission.py::test_config_space_dimension_is_refused_before_any_study[merge-regression-metric-float]
FAILED tests/test_tuning/test_h0125_tune_value_admission.py::test_config_space_dimension_is_refused_before_any_study[merge-binary-app-int]
FAILED tests/test_tuning/test_h0125_tune_value_admission.py::test_a_default_space_dimension_is_refused
FAILED tests/test_tuning/test_h0125_tune_value_admission.py::test_a_space_argument_dimension_is_refused_before_any_write[other-task]
FAILED tests/test_tuning/test_h0125_tune_value_admission.py::test_a_space_argument_dimension_is_refused_before_any_write[not-a-probability]
FAILED tests/test_tuning/test_h0125_tune_value_admission.py::test_a_space_argument_dimension_is_refused_before_any_write[numeric]
FAILED tests/test_tuning/test_h0125_tune_value_admission.py::test_a_resumed_round_with_a_stored_bad_choice_is_refused
FAILED tests/test_tuning/test_objective_identity.py::TestSummariseFrame::test_hash_pandas_object_alone_misses_the_auxiliary_cases
FAILED tests/test_tuning/test_restore_tuning.py::test_restore_commits_the_tune_state[replace]
FAILED tests/test_tuning/test_restore_tuning.py::test_restore_commits_the_tune_state[merge]
FAILED tests/test_tuning/test_restore_tuning.py::test_fit_after_restore_uses_best_and_fixed
FAILED tests/test_tuning/test_restore_tuning.py::test_threshold_report_reused
FAILED tests/test_tuning/test_restore_tuning.py::test_absent_is_tuning_failed_and_creates_no_study
FAILED tests/test_tuning/test_restore_tuning.py::test_open_is_refused_and_running_stays
FAILED tests/test_tuning/test_restore_tuning.py::test_nothing_to_restore_wins_over_a_mismatch
FAILED tests/test_tuning/test_resume_call_matrix.py::test_unreadable_schema_refused
FAILED tests/test_tuning/test_resume_call_matrix.py::test_unreadable_and_empty_is_unreadable
FAILED tests/test_tuning/test_resume_call_matrix.py::test_resume_false_onto_existing_refused[completed]
FAILED tests/test_tuning/test_resume_call_matrix.py::test_resume_false_onto_existing_refused[uninitialized]
FAILED tests/test_tuning/test_resume_call_matrix.py::test_resume_other_storage_refused
FAILED tests/test_tuning/test_resume_call_matrix.py::test_same_storage_continues[str]
FAILED tests/test_tuning/test_resume_call_matrix.py::test_same_storage_continues[same_object]
FAILED tests/test_tuning/test_resume_call_matrix.py::test_same_storage_continues[omitted]
FAILED tests/test_tuning/test_resume_call_matrix.py::test_different_target_refused[study_name]
FAILED tests/test_tuning/test_resume_call_matrix.py::test_different_target_refused[url_string]
FAILED tests/test_tuning/test_resume_call_matrix.py::test_different_target_refused[other_storage_object]
FAILED tests/test_tuning/test_resume_call_matrix.py::test_pre_record_model_target_is_unknown_not_in_memory
FAILED tests/test_tuning/test_resume_call_matrix.py::test_reattach_existing
FAILED tests/test_tuning/test_resume_call_matrix.py::test_resume_creates_missing_study_with_info_log
FAILED tests/test_tuning/test_resume_call_matrix.py::test_reattached_same_target_continues_and_name_change_refused
FAILED tests/test_tuning/test_resume_call_matrix.py::test_space_on_u3_refused
FAILED tests/test_tuning/test_resume_identity.py::test_data_path_file_rewritten_in_place_refused
FAILED tests/test_tuning/test_resume_identity.py::test_provider_fixed_change_refused[versions_same]
FAILED tests/test_tuning/test_resume_identity.py::test_provider_fixed_change_refused[versions_changed]
FAILED tests/test_tuning/test_resume_identity.py::test_edited_stored_fixed_refused_before_any_trial
FAILED tests/test_tuning/test_resume_identity.py::test_provider_default_params_change_refused[versions_same-replace]
FAILED tests/test_tuning/test_resume_identity.py::test_provider_default_params_change_refused[versions_same-merge]
FAILED tests/test_tuning/test_resume_identity.py::test_provider_default_params_change_refused[versions_changed-replace]
FAILED tests/test_tuning/test_resume_identity.py::test_provider_default_params_change_refused[versions_changed-merge]
FAILED tests/test_tuning/test_resume_lineage.py::test_unchanged_declaration_inherits_expanded_range[reattach]
FAILED tests/test_tuning/test_resume_lineage.py::test_resume_round_has_no_enqueued_trial[reattach]
FAILED tests/test_tuning/test_resume_lineage.py::test_resume_false_new_study_restarts_lineage[memory]
FAILED tests/test_tuning/test_resume_lineage.py::test_resume_false_new_study_restarts_lineage[new_name]
FAILED tests/test_tuning/test_resume_lineage.py::test_loaded_model_expands_from_study_best
FAILED tests/test_tuning/test_resume_lineage.py::test_stop_before_round_record_is_plain_resume
FAILED tests/test_tuning/test_resume_lineage.py::test_stop_after_round_record_is_open
FAILED tests/test_tuning/test_resume_lineage.py::test_stop_before_study_record_is_uninitialised
FAILED tests/test_tuning/test_resume_lineage.py::test_no_round_starts_round1
FAILED tests/test_tuning/test_resume_lineage.py::test_space_on_e_or_n_refused[uninitialised]
FAILED tests/test_tuning/test_resume_lineage.py::test_space_on_e_or_n_refused[no_round]
FAILED tests/test_tuning/test_resume_lineage.py::test_admission_failure_writes_nothing[uninitialized]
FAILED tests/test_tuning/test_resume_lineage.py::test_admission_failure_writes_nothing[no_round]
FAILED tests/test_tuning/test_resume_lineage.py::test_objective_crash_is_open_and_counts_fail
FAILED tests/test_tuning/test_resume_lineage.py::test_end_record_contents
FAILED tests/test_tuning/test_resume_open_round.py::test_crash_mid_round2_reattach_finishes_round2[new_model]
FAILED tests/test_tuning/test_resume_open_round.py::test_crash_mid_round2_reattach_finishes_round2[subprocess]
FAILED tests/test_tuning/test_resume_open_round.py::test_crash_before_end_closes_without_trials
FAILED tests/test_tuning/test_resume_open_round.py::test_single_running_trial_round1_fails_then_round2
FAILED tests/test_tuning/test_resume_open_round.py::test_u2_space_nan_choice_resumes
FAILED tests/test_tuning/test_resume_open_round.py::test_timeout_remaining_passed
FAILED tests/test_tuning/test_resume_open_round.py::test_timeout_exhausted_closes_without_trials
FAILED tests/test_tuning/test_resume_open_round.py::test_second_crash_excludes_failed_time
FAILED tests/test_tuning/test_resume_space_arg.py::test_space_mode_edit_with_space_arg_is_the_config_refusal
FAILED tests/test_tuning/test_resume_space_arg.py::test_expand_none_after_user_dim_same_after_reattach
FAILED tests/test_tuning/test_resume_space_arg.py::test_h0121_drop_on_space_rounds[in_process]
FAILED tests/test_tuning/test_resume_space_arg.py::test_h0121_drop_on_space_rounds[reattach]
FAILED tests/test_tuning/test_search_dim_magnitude.py::test_round_admission_refuses_an_effective_space_past_the_limit[float_width]
FAILED tests/test_tuning/test_search_dim_magnitude.py::test_round_admission_refuses_an_effective_space_past_the_limit[int_magnitude]
FAILED tests/test_tuning/test_search_dim_magnitude.py::test_a_round_record_with_a_huge_min_allowed_is_inconsistent[feature_fraction]
FAILED tests/test_tuning/test_search_dim_magnitude.py::test_a_round_record_with_a_huge_min_allowed_is_inconsistent[max_bin]
FAILED tests/test_tuning/test_search_dim_step_model.py::test_tune_reports_recorded_best_and_trials[storage]
FAILED tests/test_tuning/test_search_dim_step_model.py::test_restore_tuning_reports_the_recorded_best
FAILED tests/test_tuning/test_search_dim_step_model.py::test_an_earlier_round_best_is_read_with_its_own_round_step[storage]
FAILED tests/test_tuning/test_search_dim_step_model.py::test_expanded_dim_is_recorded_with_its_step
FAILED tests/test_tuning/test_search_dim_step_model.py::test_off_grid_expansion_is_refused_before_the_round_record
FAILED tests/test_tuning/test_search_dim_step_model.py::test_int_log_step_flag_change_is_refused_before_the_round[1_to_2]
FAILED tests/test_tuning/test_search_dim_step_model.py::test_int_log_step_flag_change_is_refused_before_the_round[2_to_1]
FAILED tests/test_tuning/test_search_dim_step_model.py::test_int_log_step_flag_change_is_refused_before_the_round[none_to_2]
FAILED tests/test_tuning/test_search_dim_step_model.py::test_int_log_step_flag_change_is_refused_before_the_round[2_to_none]
FAILED tests/test_tuning/test_search_dim_step_model.py::test_int_log_step_one_is_no_step[None-1]
FAILED tests/test_tuning/test_search_dim_step_model.py::test_int_log_step_one_is_no_step[1-None]
FAILED tests/test_tuning/test_smart_dimension_admission.py::test_a_new_name_in_storage_is_a_new_study_and_drops
FAILED tests/test_tuning/test_smart_dimension_admission.py::test_resume_false_onto_a_stored_study_is_refused
FAILED tests/test_tuning/test_smart_dimension_admission.py::test_resume_true_onto_an_uninitialised_study_is_a_new_study_and_drops
FAILED tests/test_tuning/test_smart_dimension_collisions.py::test_c6_space_arg_round_refused_without_changing_study_or_model[in_process]
FAILED tests/test_tuning/test_smart_dimension_collisions.py::test_c6_space_arg_round_refused_without_changing_study_or_model[reattach]
FAILED tests/test_tuning/test_smart_dimension_values.py::test_config_space_refuses_before_any_study[binary-auto_num_leaves-['false']]
FAILED tests/test_tuning/test_smart_dimension_values.py::test_config_space_refuses_before_any_study[binary-auto_num_leaves-['true', 'false']]
FAILED tests/test_tuning/test_smart_dimension_values.py::test_config_space_refuses_before_any_study[binary-auto_num_leaves-[0, 1]]
FAILED tests/test_tuning/test_smart_dimension_values.py::test_config_space_refuses_before_any_study[binary-auto_num_leaves-[None]]
FAILED tests/test_tuning/test_smart_dimension_values.py::test_config_space_refuses_before_any_study[binary-auto_num_leaves-int(0,1)]
FAILED tests/test_tuning/test_smart_dimension_values.py::test_config_space_refuses_before_any_study[binary-auto_num_leaves-float(0.0,1.0)]
FAILED tests/test_tuning/test_smart_dimension_values.py::test_config_space_refuses_before_any_study[binary-balanced-['false']]
FAILED tests/test_tuning/test_smart_dimension_values.py::test_config_space_refuses_before_any_study[binary-balanced-[1]]
FAILED tests/test_tuning/test_smart_dimension_values.py::test_config_space_refuses_before_any_study[binary-balanced-int(0,1)]
FAILED tests/test_tuning/test_smart_dimension_values.py::test_config_space_refuses_before_any_study[regression-balanced-[True, False]]
FAILED tests/test_tuning/test_smart_dimension_values.py::test_config_space_refuses_before_any_study[regression-balanced-[True]]
FAILED tests/test_tuning/test_smart_dimension_values.py::test_config_space_refuses_before_any_study[binary-num_leaves_ratio-float(-1.0,1.0)]
FAILED tests/test_tuning/test_smart_dimension_values.py::test_config_space_refuses_before_any_study[binary-num_leaves_ratio-float(0.0,1.0)]
FAILED tests/test_tuning/test_smart_dimension_values.py::test_config_space_refuses_before_any_study[binary-num_leaves_ratio-float(0.5,2.0)]
FAILED tests/test_tuning/test_smart_dimension_values.py::test_config_space_refuses_before_any_study[binary-num_leaves_ratio-[0.5, None]]
FAILED tests/test_tuning/test_smart_dimension_values.py::test_config_space_refuses_before_any_study[binary-num_leaves_ratio-[True]]
FAILED tests/test_tuning/test_smart_dimension_values.py::test_config_space_refuses_before_any_study[binary-num_leaves_ratio-['0.5']]
FAILED tests/test_tuning/test_smart_dimension_values.py::test_config_space_refuses_before_any_study[binary-num_leaves_ratio-[nan]]
FAILED tests/test_tuning/test_smart_dimension_values.py::test_config_space_refuses_before_any_study[binary-num_leaves_ratio-[inf]]
FAILED tests/test_tuning/test_smart_dimension_values.py::test_config_space_refuses_before_any_study[binary-min_data_in_leaf_ratio-float(0.0,0.2)]
FAILED tests/test_tuning/test_smart_dimension_values.py::test_config_space_refuses_before_any_study[binary-min_data_in_leaf_ratio-float(0.1,1.0)]
FAILED tests/test_tuning/test_smart_dimension_values.py::test_config_space_refuses_before_any_study[binary-min_data_in_leaf_ratio-['0.1']]
FAILED tests/test_tuning/test_smart_dimension_values.py::test_config_space_refuses_before_any_study[binary-min_data_in_leaf_ratio-[1.0]]
FAILED tests/test_tuning/test_smart_dimension_values.py::test_config_space_refuses_before_any_study[binary-min_data_in_leaf_ratio-[nan]]
FAILED tests/test_tuning/test_smart_dimension_values.py::test_config_space_refuses_before_any_study[binary-min_data_in_bin_ratio-float(0.0,0.2)]
FAILED tests/test_tuning/test_smart_dimension_values.py::test_config_space_refuses_before_any_study[binary-min_data_in_bin_ratio-float(0.5,1.0)]
FAILED tests/test_tuning/test_smart_dimension_values.py::test_config_space_refuses_before_any_study[binary-min_data_in_bin_ratio-[0]]
FAILED tests/test_tuning/test_smart_dimension_values.py::test_config_space_refuses_before_any_study[binary-min_data_in_bin_ratio-['0.05']]
FAILED tests/test_tuning/test_smart_dimension_values.py::test_config_space_refuses_before_any_study[binary-feature_weights-[None]]
FAILED tests/test_tuning/test_smart_dimension_values.py::test_config_space_refuses_before_any_study[binary-feature_weights-[0.5]]
FAILED tests/test_tuning/test_smart_dimension_values.py::test_config_space_refuses_before_any_study[binary-feature_weights-float(0.1,1.0)]
FAILED tests/test_tuning/test_smart_dimension_values.py::test_default_ratio_best_at_one_is_clamped_not_expanded
FAILED tests/test_tuning/test_smart_dimension_values.py::test_an_expanded_dimension_outside_the_rule_is_refused_before_the_record
FAILED tests/test_tuning/test_smart_dimension_values.py::test_a_default_space_dimension_outside_the_rule_is_refused
FAILED tests/test_tuning/test_smart_dimension_values.py::test_restore_tuning_refuses_a_string_bool_result
FAILED tests/test_tuning/test_smart_dimension_values.py::test_resume_refuses_a_legacy_best_whose_smart_dimension_was_removed[reattach]
FAILED tests/test_tuning/test_smart_dimension_values.py::test_a_legacy_non_best_trial_outside_the_rule_is_refused[resume]
FAILED tests/test_tuning/test_smart_dimension_values.py::test_a_legacy_non_best_trial_outside_the_rule_is_refused[restore]
FAILED tests/test_tuning/test_smart_dimension_values.py::test_restore_tuning_accepts_a_result_inside_the_rule
FAILED tests/test_tuning/test_space_merge.py::test_removed_training_dimension_admission[False]
FAILED tests/test_tuning/test_tuner_persistence.py::TestModelTunePassThrough::test_model_tune_persists_via_sqlite
FAILED tests/test_tuning/test_tuner_persistence.py::TestModelTunePassThrough::test_model_tune_reattaches_only_with_resume
179 failed, 11103 passed, 230 skipped, 21 deselected, 4 xfailed, 871 warnings, 182 errors in 119.24s (0:01:59)
