SKIPPED [230] tests/test_core/test_param_domain.py:250: holds a mapping: never serialised as itself
FAILED tests/test_codegen/test_calibration_params_codegen.py::test_generated_fitter_matches_the_runtime_calibrator[platt-params1]
FAILED tests/test_core/test_param_domain.py::test_a_value_with_no_plain_stand_in_is_refused_rather_than_rounded
FAILED tests/test_core/test_param_domain.py::test_unchanged_is_decided_by_type_and_not_by_printed_text
FAILED tests/test_e2e/test_version.py::TestVersion::test_version_matches_package_metadata
FAILED tests/test_tuning/test_objective_identity.py::TestSummariseFrame::test_hash_pandas_object_alone_misses_the_auxiliary_cases
5 failed, 11460 passed, 230 skipped, 21 deselected, 4 xfailed, 925 warnings in 204.09s (0:03:24)
pydantic==2.1.0 pydantic-core==2.4.0 numpy==1.24.0 pandas==2.0.0 scikit-learn==1.3.0 lightgbm==4.4.0 pyyaml==6.0 joblib==1.3.0 optuna==3.1.0 shap==0.44.0 plotly==5.0.0 scipy==1.10.0 numba==0.68.0 