================================== FAILURES ===================================
=========================== short test summary info ===========================
FAILED tests/genesis/test_ingestion_manager_anomaly.py::TestEmbedChunks::test_embeds_all_chunks - assert 0 == 5
FAILED tests/genesis/test_ingestion_manager_anomaly.py::TestEmbedChunks::test_default_batch_size_used_when_none - assert 0 == 1
FAILED tests/genesis/test_kanban_message_injection.py::test_executor_loop_drains_queue - AssertionError: expected 2 invocations, got 0
FAILED tests/genesis/test_kanban_message_injection.py::test_executor_loop_stops_when_queue_empty - assert 0 == 1
FAILED tests/workflow/test_pipeline_grader.py::test_all_pass_is_satisfied - AssertionError: assert 'grader_error' == 'satisfied'
FAILED tests/workflow/test_pipeline_grader.py::test_gate_failure_is_needs_revision_with_detail - AssertionError: assert 'grader_error' == 'needs_revision'
FAILED tests/workflow/test_pipeline_grader.py::test_conformance_false_is_needs_revision_with_unmet - AssertionError: assert 'grader_error' == 'needs_revision'
FAILED tests/workflow/test_pipeline_grader.py::test_conformance_none_does_not_block - AssertionError: assert 'grader_error' == 'satisfied'
FAILED tests/workflow/test_pipeline_grader.py::test_run_conformance_false_skips_reviewer - AssertionError: assert 'grader_error' == 'satisfied'
FAILED tests/workflow/test_pipeline_grader.py::test_modified_files_callable_resolved_at_grade_time - IndexError: list index out of range
FAILED tests/workflow/test_pipeline_grader.py::test_gate_suite_exception_is_grader_error - assert 'worktree vanished' in "gate suite error: patch_collab.<locals>._vwt...
FAILED tests/workflow/test_pipeline_grader.py::test_run_e2e_passthrough - IndexError: list index out of range
12 failed, 577 passed in 34.12s
