[run-exclusive] pr8c-red-before starting; load was 0.00
#258 rc=1 38 failed, 13 passed, 29 warnings in 2.09s
    collection_error=False raised=['AssertionError']
    files existed before: {'tests/test_tuning/test_direction_reconciliation.py': False, 'tests/_train_spy.py': False, 'tests/_ast_scan.py': False, 'tests/test_data/_hostile_arrays.py': False, 'tests/test_config/_knob_registry.py': False, 'tests/test_persistence/_load_census.py': False, 'tests/test_docs/__init__.py': False}
#259 rc=1 5 failed, 1 passed in 1.05s
    collection_error=False raised=['AttributeError']
    files existed before: {'tests/test_features/test_pipeline_conformance.py': False, 'tests/_train_spy.py': False, 'tests/_ast_scan.py': False, 'tests/test_data/_hostile_arrays.py': False, 'tests/test_config/_knob_registry.py': False, 'tests/test_persistence/_load_census.py': False, 'tests/test_docs/__init__.py': False}
#260 rc=1 25 failed, 2 passed in 1.17s
    collection_error=False raised=['AssertionError', 'KeyError']
    files existed before: {'tests/test_features/test_unseen_policy.py': False, 'tests/test_codegen/test_unseen_policy_codegen.py': False, 'tests/_train_spy.py': False, 'tests/_ast_scan.py': False, 'tests/test_data/_hostile_arrays.py': False, 'tests/test_config/_knob_registry.py': False, 'tests/test_persistence/_load_census.py': False, 'tests/test_docs/__init__.py': False}
#261 rc=1 14 failed, 25 passed, 10 warnings in 1.39s
    collection_error=False raised=['AssertionError', 'AttributeError']
    files existed before: {'tests/test_estimators/test_lightgbm_parameter_names.py': False, 'tests/_train_spy.py': False, 'tests/_ast_scan.py': False, 'tests/test_data/_hostile_arrays.py': False, 'tests/test_config/_knob_registry.py': False, 'tests/test_persistence/_load_census.py': False, 'tests/test_docs/__init__.py': False}
#262 rc=1 18 failed, 10 passed, 9 xfailed, 24 warnings in 1.85s
    collection_error=False raised=[]
    files existed before: {'tests/test_tuning/test_search_space_name_validation.py': False, 'tests/_train_spy.py': False, 'tests/_ast_scan.py': False, 'tests/test_data/_hostile_arrays.py': False, 'tests/test_config/_knob_registry.py': False, 'tests/test_persistence/_load_census.py': False, 'tests/test_docs/__init__.py': False}
#263 rc=1 7 failed, 17 passed, 4 warnings in 1.23s
    collection_error=False raised=['AssertionError', 'ValueError']
    files existed before: {'tests/test_core/test_error_code_raising.py': False, 'tests/test_core/test_error_code_population.py': False, 'tests/test_docs/test_error_code_docs.py': False, 'tests/_train_spy.py': False, 'tests/_ast_scan.py': False, 'tests/test_data/_hostile_arrays.py': False, 'tests/test_config/_knob_registry.py': False, 'tests/test_persistence/_load_census.py': False, 'tests/test_docs/__init__.py': False}
#264 rc=2 1 error in 0.88s
    collection_error=True raised=['ImportError']
    files existed before: {'tests/test_core/test_fit_params_override.py': False, 'tests/_train_spy.py': False, 'tests/_ast_scan.py': False, 'tests/test_data/_hostile_arrays.py': False, 'tests/test_config/_knob_registry.py': False, 'tests/test_persistence/_load_census.py': False, 'tests/test_docs/__init__.py': False}
#265 rc=0 9 passed in 0.74s
    collection_error=False raised=[]
    files existed before: {'tests/test_training/test_inner_valid_purge_embargo.py': True, 'tests/_train_spy.py': False, 'tests/_ast_scan.py': False, 'tests/test_data/_hostile_arrays.py': False, 'tests/test_config/_knob_registry.py': False, 'tests/test_persistence/_load_census.py': False, 'tests/test_docs/__init__.py': False}
#266 rc=1 4 failed, 9 passed in 0.77s
    collection_error=False raised=['AssertionError']
    files existed before: {'tests/test_docs/test_declared_versions.py': False, 'tests/_train_spy.py': False, 'tests/_ast_scan.py': False, 'tests/test_data/_hostile_arrays.py': False, 'tests/test_config/_knob_registry.py': False, 'tests/test_persistence/_load_census.py': False, 'tests/test_docs/__init__.py': False}
#267 rc=1 34 failed, 3 passed in 2.88s
    collection_error=False raised=['AssertionError', 'OverflowError']
    files existed before: {'tests/test_data/test_leakage_validator_unchecked_column.py': False, 'tests/_train_spy.py': False, 'tests/_ast_scan.py': False, 'tests/test_data/_hostile_arrays.py': False, 'tests/test_config/_knob_registry.py': False, 'tests/test_persistence/_load_census.py': False, 'tests/test_docs/__init__.py': False}
#268 rc=1 1 failed, 6 passed, 17 warnings, 80 errors in 9.16s
    collection_error=False raised=['ValueError']
    files existed before: {'tests/test_config/test_knob_reachability.py': False, 'tests/_train_spy.py': False, 'tests/_ast_scan.py': False, 'tests/test_data/_hostile_arrays.py': False, 'tests/test_config/_knob_registry.py': False, 'tests/test_persistence/_load_census.py': False, 'tests/test_docs/__init__.py': False}
#269 rc=1 7 failed, 6 passed, 9 warnings in 1.35s
    collection_error=False raised=['AssertionError']
    files existed before: {'tests/test_training/test_cv_refit_parity.py': False, 'tests/_train_spy.py': False, 'tests/_ast_scan.py': False, 'tests/test_data/_hostile_arrays.py': False, 'tests/test_config/_knob_registry.py': False, 'tests/test_persistence/_load_census.py': False, 'tests/test_docs/__init__.py': False}
#270 rc=2 1 error in 0.78s
    collection_error=True raised=['ModuleNotFoundError']
    files existed before: {'tests/test_estimators/test_param_behavioral_effect.py': True, 'tests/test_core/test_config_propagation.py': True, 'tests/_train_spy.py': False, 'tests/_ast_scan.py': False, 'tests/test_data/_hostile_arrays.py': False, 'tests/test_config/_knob_registry.py': False, 'tests/test_persistence/_load_census.py': False, 'tests/test_docs/__init__.py': False}
#272 rc=1 20 failed, 36 passed in 0.81s
    collection_error=False raised=['ImportError', 'OverflowError']
    files existed before: {'tests/test_config/test_config_version_entry_paths.py': False, 'tests/_train_spy.py': False, 'tests/_ast_scan.py': False, 'tests/test_data/_hostile_arrays.py': False, 'tests/test_config/_knob_registry.py': False, 'tests/test_persistence/_load_census.py': False, 'tests/test_docs/__init__.py': False}
#277 rc=2 2 errors in 0.86s
    collection_error=True raised=['ModuleNotFoundError']
    files existed before: {'tests/test_core/test_calibration_params_reach.py': False, 'tests/test_calibration/test_calibration_param_contract.py': False, 'tests/test_calibration/test_platt_mle.py': False, 'tests/test_codegen/test_calibration_params_codegen.py': False, 'tests/_train_spy.py': False, 'tests/_ast_scan.py': False, 'tests/test_data/_hostile_arrays.py': False, 'tests/test_config/_knob_registry.py': False, 'tests/test_persistence/_load_census.py': False, 'tests/test_docs/__init__.py': False}
#279 rc=2 1 error in 0.76s
    collection_error=True raised=['AttributeError']
    files existed before: {'tests/test_tuning/test_dimension_consumption.py': False, 'tests/_train_spy.py': False, 'tests/_ast_scan.py': False, 'tests/test_data/_hostile_arrays.py': False, 'tests/test_config/_knob_registry.py': False, 'tests/test_persistence/_load_census.py': False, 'tests/test_docs/__init__.py': False}
#281 rc=1 38 failed, 2 passed, 37 warnings in 5.44s
    collection_error=False raised=['AssertionError']
    files existed before: {'tests/test_persistence/test_reporting_surfaces_survive_load.py': False, 'tests/test_persistence/test_applied_training_params.py': False, 'tests/_train_spy.py': False, 'tests/_ast_scan.py': False, 'tests/test_data/_hostile_arrays.py': False, 'tests/test_config/_knob_registry.py': False, 'tests/test_persistence/_load_census.py': False, 'tests/test_docs/__init__.py': False}
#282 rc=2 1 error in 0.76s
    collection_error=True raised=['AttributeError']
    files existed before: {'tests/test_tuning/test_dimension_consumption.py': False, 'tests/_train_spy.py': False, 'tests/_ast_scan.py': False, 'tests/test_data/_hostile_arrays.py': False, 'tests/test_config/_knob_registry.py': False, 'tests/test_persistence/_load_census.py': False, 'tests/test_docs/__init__.py': False}
#284 rc=2 1 error in 0.77s
    collection_error=True raised=['ModuleNotFoundError']
    files existed before: {'tests/test_core/test_param_domain_cycles.py': False, 'tests/_train_spy.py': False, 'tests/_ast_scan.py': False, 'tests/test_data/_hostile_arrays.py': False, 'tests/test_config/_knob_registry.py': False, 'tests/test_persistence/_load_census.py': False, 'tests/test_docs/__init__.py': False}
#285 rc=2 1 error in 0.78s
    collection_error=True raised=['ImportError']
    files existed before: {'tests/test_core/test_param_refusal_origin.py': False, 'tests/_train_spy.py': False, 'tests/_ast_scan.py': False, 'tests/test_data/_hostile_arrays.py': False, 'tests/test_config/_knob_registry.py': False, 'tests/test_persistence/_load_census.py': False, 'tests/test_docs/__init__.py': False}
#287 rc=2 1 error in 0.80s
    collection_error=True raised=['ModuleNotFoundError']
    files existed before: {'tests/test_tuning/test_literal_domain_contract.py': False, 'tests/_train_spy.py': False, 'tests/_ast_scan.py': False, 'tests/test_data/_hostile_arrays.py': False, 'tests/test_config/_knob_registry.py': False, 'tests/test_persistence/_load_census.py': False, 'tests/test_docs/__init__.py': False}
#288 rc=2 1 error in 0.84s
    collection_error=True raised=['ImportError']
    files existed before: {'tests/test_core/test_fit_params_override.py': False, 'tests/_train_spy.py': False, 'tests/_ast_scan.py': False, 'tests/test_data/_hostile_arrays.py': False, 'tests/test_config/_knob_registry.py': False, 'tests/test_persistence/_load_census.py': False, 'tests/test_docs/__init__.py': False}
#306 rc=1 19 failed, 44 passed, 5 warnings in 2.05s
    collection_error=False raised=['AssertionError', 'ValueError']
    files existed before: {'tests/test_estimators/test_feval_probabilities.py': False, 'tests/_train_spy.py': False, 'tests/_ast_scan.py': False, 'tests/test_data/_hostile_arrays.py': False, 'tests/test_config/_knob_registry.py': False, 'tests/test_persistence/_load_census.py': False, 'tests/test_docs/__init__.py': False}
[run-exclusive] pr8c-red-before finished in 46s, exit 0

[exited with code 0]
