F.......F.............F............F.......... [ 80%]
...F.......                                                  [100%]
=================================== FAILURES ===================================
_ Phase15AReleasePackagingTests.test_converter_subtree_preserves_checkpoint_e_and_records_phase16 _
tests/test_phase15a_release_packaging.py:137: in test_converter_subtree_preserves_checkpoint_e_and_records_phase16
    self.assertEqual(
E   AssertionError: 144 != 135
_ Phase15BReleasePackagingTests.test_converter_subtree_preserves_phase15b_and_records_phase16 _
tests/test_phase15b_release_packaging.py:731: in test_converter_subtree_preserves_phase15b_and_records_phase16
    digest, count = release_subtree_hash(
tools/build_phase15b_release.py:631: in release_subtree_hash
    files = release_file_map(root)
            ^^^^^^^^^^^^^^^^^^^^^^
tools/build_phase15b_release.py:533: in release_file_map
    raise ReleaseBuildError(
E   tools.build_phase15b_release.ReleaseBuildError: release snapshot file exceeds per-file byte limit: evidence/source_loading_1_3_50/changes.patch
____ Phase15BReleasePackagingTests.test_release_tree_hash_is_self_excluding ____
tests/test_phase15b_release_packaging.py:687: in test_release_tree_hash_is_self_excluding
    files = release_file_map(ROOT)
            ^^^^^^^^^^^^^^^^^^^^^^
tools/build_phase15b_release.py:533: in release_file_map
    raise ReleaseBuildError(
E   tools.build_phase15b_release.ReleaseBuildError: release snapshot file exceeds per-file byte limit: evidence/source_loading_1_3_50/changes.patch
_ Phase15CReleasePackagingTests.test_converter_subtree_preserves_phase15c_and_records_phase16 _
tests/test_phase15c_release_packaging.py:761: in test_converter_subtree_preserves_phase15c_and_records_phase16
    digest, count = release_subtree_hash(
tools/build_phase15c_release.py:670: in release_subtree_hash
    files = release_file_map(root)
            ^^^^^^^^^^^^^^^^^^^^^^
tools/build_phase15c_release.py:572: in release_file_map
    raise ReleaseBuildError(
E   tools.build_phase15c_release.ReleaseBuildError: release snapshot file exceeds per-file byte limit: evidence/source_loading_1_3_50/changes.patch
____ Phase15CReleasePackagingTests.test_release_tree_hash_is_self_excluding ____
tests/test_phase15c_release_packaging.py:717: in test_release_tree_hash_is_self_excluding
    files = release_file_map(ROOT)
            ^^^^^^^^^^^^^^^^^^^^^^
tools/build_phase15c_release.py:572: in release_file_map
    raise ReleaseBuildError(
E   tools.build_phase15c_release.ReleaseBuildError: release snapshot file exceeds per-file byte limit: evidence/source_loading_1_3_50/changes.patch
=========================== short test summary info ============================
FAILED tests/test_phase15a_release_packaging.py::Phase15AReleasePackagingTests::test_converter_subtree_preserves_checkpoint_e_and_records_phase16
FAILED tests/test_phase15b_release_packaging.py::Phase15BReleasePackagingTests::test_converter_subtree_preserves_phase15b_and_records_phase16
FAILED tests/test_phase15b_release_packaging.py::Phase15BReleasePackagingTests::test_release_tree_hash_is_self_excluding
FAILED tests/test_phase15c_release_packaging.py::Phase15CReleasePackagingTests::test_converter_subtree_preserves_phase15c_and_records_phase16
FAILED tests/test_phase15c_release_packaging.py::Phase15CReleasePackagingTests::test_release_tree_hash_is_self_excluding
5 failed, 52 passed, 38 subtests passed in 1.65s
